[11:14:43.605] su postgres <<-EOF
[11:14:43.605]   ulimit -c unlimited
[11:14:43.605]   meson test $MTEST_ARGS --num-processes ${TEST_JOBS}
[11:14:43.605] EOF
[11:14:44.740]   1/323 postgresql:setup / tmp_install                                                  OK                0.80s
[11:14:44.793]   2/323 postgresql:setup / install_test_files                                           OK                0.05s
[11:14:46.218]   3/323 postgresql:setup / initdb_cache                                                 OK                1.42s
[11:14:46.473]   4/323 postgresql:pg_upgrade / pg_upgrade/001_basic                                    OK                0.25s   9 subtests passed
[11:14:47.584] ▶   5/323 pg_ctl stop failed                                                            ERROR         
[11:14:47.585]   5/323 postgresql:pg_upgrade / pg_upgrade/003_logical_slots                            ERROR             1.35s   (exit status 255 or signal 127 SIGinvalid)
[11:14:47.585] >>> LD_LIBRARY_PATH=/tmp/cirrus-ci-build/build/tmp_install//usr/local/pgsql/lib/x86_64-linux-gnu MALLOC_PERTURB_=230 share_contrib_dir=/tmp/cirrus-ci-build/build/tmp_install//usr/local/pgsql/share/contrib PATH=/tmp/cirrus-ci-build/build/tmp_install//usr/local/pgsql/bin:/tmp/cirrus-ci-build/build/src/bin/pg_upgrade:/tmp/cirrus-ci-build/build/src/bin/pg_upgrade/test:/usr/local/sbin:/usr/local/bin:/usr/sbin:/usr/bin:/sbin:/bin with_icu=yes REGRESS_SHLIB=/tmp/cirrus-ci-build/build/src/test/regress/regress.so PG_REGRESS=/tmp/cirrus-ci-build/build/src/test/regress/pg_regress INITDB_TEMPLATE=/tmp/cirrus-ci-build/build/tmp_install/initdb-template /usr/bin/python3 /tmp/cirrus-ci-build/build/../src/tools/testwrap --basedir /tmp/cirrus-ci-build/build --srcdir /tmp/cirrus-ci-build/src/bin/pg_upgrade --pg-test-extra '' --testgroup pg_upgrade --testname 003_logical_slots -- /usr/bin/perl -I /tmp/cirrus-ci-build/src/test/perl -I /tmp/cirrus-ci-build/src/bin/pg_upgrade /tmp/cirrus-ci-build/src/bin/pg_upgrade/t/003_logical_slots.pl
[11:14:47.585] ――――――――――――――――――――――――――――――――――――― ✀  ―――――――――――――――――――――――――――――――――――――
[11:14:47.585] stderr:
[11:14:47.585] 
[11:14:47.585] (test program exited with status code 255)
[11:14:47.585] ――――――――――――――――――――――――――――――――――――――――――――――――――――――――――――――――――――――――――――――
[11:14:47.585] 
[11:14:48.667] ▶   6/323 pg_ctl stop failed                                                            ERROR         
[11:14:48.668]   6/323 postgresql:recovery / recovery/001_stream_rep                                   ERROR             2.38s   (exit status 255 or signal 127 SIGinvalid)
[11:14:48.668] >>> LD_LIBRARY_PATH=/tmp/cirrus-ci-build/build/tmp_install//usr/local/pgsql/lib/x86_64-linux-gnu enable_injection_points=yes share_contrib_dir=/tmp/cirrus-ci-build/build/tmp_install//usr/local/pgsql/share/contrib PATH=/tmp/cirrus-ci-build/build/tmp_install//usr/local/pgsql/bin:/tmp/cirrus-ci-build/build/src/test/recovery:/tmp/cirrus-ci-build/build/src/test/recovery/test:/usr/local/sbin:/usr/local/bin:/usr/sbin:/usr/bin:/sbin:/bin REGRESS_SHLIB=/tmp/cirrus-ci-build/build/src/test/regress/regress.so PG_REGRESS=/tmp/cirrus-ci-build/build/src/test/regress/pg_regress MALLOC_PERTURB_=112 INITDB_TEMPLATE=/tmp/cirrus-ci-build/build/tmp_install/initdb-template /usr/bin/python3 /tmp/cirrus-ci-build/build/../src/tools/testwrap --basedir /tmp/cirrus-ci-build/build --srcdir /tmp/cirrus-ci-build/src/test/recovery --pg-test-extra '' --testgroup recovery --testname 001_stream_rep -- /usr/bin/perl -I /tmp/cirrus-ci-build/src/test/perl -I /tmp/cirrus-ci-build/src/test/recovery /tmp/cirrus-ci-build/src/test/recovery/t/001_stream_rep.pl
[11:14:48.668] ――――――――――――――――――――――――――――――――――――― ✀  ―――――――――――――――――――――――――――――――――――――
[11:14:48.668] stderr:
[11:14:48.668] 
[11:14:48.668] (test program exited with status code 255)
[11:14:48.668] ――――――――――――――――――――――――――――――――――――――――――――――――――――――――――――――――――――――――――――――
[11:14:48.668] 
[11:14:50.936] ▶   7/323 pg_ctl stop failed                                                            ERROR         
[11:14:50.936]   7/323 postgresql:recovery / recovery/003_recovery_targets                             ERROR             4.46s   (exit status 255 or signal 127 SIGinvalid)
[11:14:50.937] >>> LD_LIBRARY_PATH=/tmp/cirrus-ci-build/build/tmp_install//usr/local/pgsql/lib/x86_64-linux-gnu enable_injection_points=yes share_contrib_dir=/tmp/cirrus-ci-build/build/tmp_install//usr/local/pgsql/share/contrib PATH=/tmp/cirrus-ci-build/build/tmp_install//usr/local/pgsql/bin:/tmp/cirrus-ci-build/build/src/test/recovery:/tmp/cirrus-ci-build/build/src/test/recovery/test:/usr/local/sbin:/usr/local/bin:/usr/sbin:/usr/bin:/sbin:/bin MALLOC_PERTURB_=163 REGRESS_SHLIB=/tmp/cirrus-ci-build/build/src/test/regress/regress.so PG_REGRESS=/tmp/cirrus-ci-build/build/src/test/regress/pg_regress INITDB_TEMPLATE=/tmp/cirrus-ci-build/build/tmp_install/initdb-template /usr/bin/python3 /tmp/cirrus-ci-build/build/../src/tools/testwrap --basedir /tmp/cirrus-ci-build/build --srcdir /tmp/cirrus-ci-build/src/test/recovery --pg-test-extra '' --testgroup recovery --testname 003_recovery_targets -- /usr/bin/perl -I /tmp/cirrus-ci-build/src/test/perl -I /tmp/cirrus-ci-build/src/test/recovery /tmp/cirrus-ci-build/src/test/recovery/t/003_recovery_targets.pl
[11:14:50.937] ――――――――――――――――――――――――――――――――――――― ✀  ―――――――――――――――――――――――――――――――――――――
[11:14:50.937] stderr:
[11:14:50.937] 
[11:14:50.937] (test program exited with status code 255)
[11:14:50.937] ――――――――――――――――――――――――――――――――――――――――――――――――――――――――――――――――――――――――――――――
[11:14:50.937] 
[11:14:51.036]   8/323 postgresql:recovery / recovery/002_archiving                                    OK                4.73s   8 subtests passed
[11:14:51.231] ▶   9/323 pg_ctl stop failed                                                            ERROR         
[11:14:51.232]   9/323 postgresql:recovery / recovery/004_timeline_switch                              ERROR             3.65s   (exit status 255 or signal 127 SIGinvalid)
[11:14:51.232] >>> LD_LIBRARY_PATH=/tmp/cirrus-ci-build/build/tmp_install//usr/local/pgsql/lib/x86_64-linux-gnu MALLOC_PERTURB_=94 enable_injection_points=yes share_contrib_dir=/tmp/cirrus-ci-build/build/tmp_install//usr/local/pgsql/share/contrib PATH=/tmp/cirrus-ci-build/build/tmp_install//usr/local/pgsql/bin:/tmp/cirrus-ci-build/build/src/test/recovery:/tmp/cirrus-ci-build/build/src/test/recovery/test:/usr/local/sbin:/usr/local/bin:/usr/sbin:/usr/bin:/sbin:/bin REGRESS_SHLIB=/tmp/cirrus-ci-build/build/src/test/regress/regress.so PG_REGRESS=/tmp/cirrus-ci-build/build/src/test/regress/pg_regress INITDB_TEMPLATE=/tmp/cirrus-ci-build/build/tmp_install/initdb-template /usr/bin/python3 /tmp/cirrus-ci-build/build/../src/tools/testwrap --basedir /tmp/cirrus-ci-build/build --srcdir /tmp/cirrus-ci-build/src/test/recovery --pg-test-extra '' --testgroup recovery --testname 004_timeline_switch -- /usr/bin/perl -I /tmp/cirrus-ci-build/src/test/perl -I /tmp/cirrus-ci-build/src/test/recovery /tmp/cirrus-ci-build/src/test/recovery/t/004_timeline_switch.pl
[11:14:51.232] ――――――――――――――――――――――――――――――――――――― ✀  ―――――――――――――――――――――――――――――――――――――
[11:14:51.232] stderr:
[11:14:51.232] 
[11:14:51.232] (test program exited with status code 255)
[11:14:51.232] ――――――――――――――――――――――――――――――――――――――――――――――――――――――――――――――――――――――――――――――
[11:14:51.232] 
[11:14:51.265] ▶  10/323 pg_ctl stop failed                                                            ERROR         
[11:14:51.266]  10/323 postgresql:pg_upgrade / pg_upgrade/004_subscription                             ERROR             5.01s   (exit status 255 or signal 127 SIGinvalid)
[11:14:51.267] >>> MALLOC_PERTURB_=228 LD_LIBRARY_PATH=/tmp/cirrus-ci-build/build/tmp_install//usr/local/pgsql/lib/x86_64-linux-gnu share_contrib_dir=/tmp/cirrus-ci-build/build/tmp_install//usr/local/pgsql/share/contrib PATH=/tmp/cirrus-ci-build/build/tmp_install//usr/local/pgsql/bin:/tmp/cirrus-ci-build/build/src/bin/pg_upgrade:/tmp/cirrus-ci-build/build/src/bin/pg_upgrade/test:/usr/local/sbin:/usr/local/bin:/usr/sbin:/usr/bin:/sbin:/bin with_icu=yes REGRESS_SHLIB=/tmp/cirrus-ci-build/build/src/test/regress/regress.so PG_REGRESS=/tmp/cirrus-ci-build/build/src/test/regress/pg_regress INITDB_TEMPLATE=/tmp/cirrus-ci-build/build/tmp_install/initdb-template /usr/bin/python3 /tmp/cirrus-ci-build/build/../src/tools/testwrap --basedir /tmp/cirrus-ci-build/build --srcdir /tmp/cirrus-ci-build/src/bin/pg_upgrade --pg-test-extra '' --testgroup pg_upgrade --testname 004_subscription -- /usr/bin/perl -I /tmp/cirrus-ci-build/src/test/perl -I /tmp/cirrus-ci-build/src/bin/pg_upgrade /tmp/cirrus-ci-build/src/bin/pg_upgrade/t/004_subscription.pl
[11:14:51.267] ――――――――――――――――――――――――――――――――――――― ✀  ―――――――――――――――――――――――――――――――――――――
[11:14:51.267] stderr:
[11:14:51.267] 
[11:14:51.267] (test program exited with status code 255)
[11:14:51.267] ――――――――――――――――――――――――――――――――――――――――――――――――――――――――――――――――――――――――――――――
[11:14:51.267] 
[11:14:52.356] ▶  11/323 pg_ctl restart failed                                                         ERROR         
[11:14:52.357]  11/323 postgresql:recovery / recovery/006_logical_decoding                             ERROR             1.42s   (exit status 255 or signal 127 SIGinvalid)
[11:14:52.357] >>> LD_LIBRARY_PATH=/tmp/cirrus-ci-build/build/tmp_install//usr/local/pgsql/lib/x86_64-linux-gnu MALLOC_PERTURB_=24 enable_injection_points=yes share_contrib_dir=/tmp/cirrus-ci-build/build/tmp_install//usr/local/pgsql/share/contrib PATH=/tmp/cirrus-ci-build/build/tmp_install//usr/local/pgsql/bin:/tmp/cirrus-ci-build/build/src/test/recovery:/tmp/cirrus-ci-build/build/src/test/recovery/test:/usr/local/sbin:/usr/local/bin:/usr/sbin:/usr/bin:/sbin:/bin REGRESS_SHLIB=/tmp/cirrus-ci-build/build/src/test/regress/regress.so PG_REGRESS=/tmp/cirrus-ci-build/build/src/test/regress/pg_regress INITDB_TEMPLATE=/tmp/cirrus-ci-build/build/tmp_install/initdb-template /usr/bin/python3 /tmp/cirrus-ci-build/build/../src/tools/testwrap --basedir /tmp/cirrus-ci-build/build --srcdir /tmp/cirrus-ci-build/src/test/recovery --pg-test-extra '' --testgroup recovery --testname 006_logical_decoding -- /usr/bin/perl -I /tmp/cirrus-ci-build/src/test/perl -I /tmp/cirrus-ci-build/src/test/recovery /tmp/cirrus-ci-build/src/test/recovery/t/006_logical_decoding.pl
[11:14:52.357] ――――――――――――――――――――――――――――――――――――― ✀  ―――――――――――――――――――――――――――――――――――――
[11:14:52.357] stderr:
[11:14:52.357] 
[11:14:52.357] (test program exited with status code 255)
[11:14:52.357] ――――――――――――――――――――――――――――――――――――――――――――――――――――――――――――――――――――――――――――――
[11:14:52.357] 
[11:14:53.785] ▶  12/323 pg_ctl stop failed                                                            ERROR         
[11:14:53.787]  12/323 postgresql:recovery / recovery/009_twophase                                     ERROR             2.52s   (exit status 255 or signal 127 SIGinvalid)
[11:14:53.787] >>> LD_LIBRARY_PATH=/tmp/cirrus-ci-build/build/tmp_install//usr/local/pgsql/lib/x86_64-linux-gnu enable_injection_points=yes share_contrib_dir=/tmp/cirrus-ci-build/build/tmp_install//usr/local/pgsql/share/contrib PATH=/tmp/cirrus-ci-build/build/tmp_install//usr/local/pgsql/bin:/tmp/cirrus-ci-build/build/src/test/recovery:/tmp/cirrus-ci-build/build/src/test/recovery/test:/usr/local/sbin:/usr/local/bin:/usr/sbin:/usr/bin:/sbin:/bin REGRESS_SHLIB=/tmp/cirrus-ci-build/build/src/test/regress/regress.so PG_REGRESS=/tmp/cirrus-ci-build/build/src/test/regress/pg_regress INITDB_TEMPLATE=/tmp/cirrus-ci-build/build/tmp_install/initdb-template MALLOC_PERTURB_=19 /usr/bin/python3 /tmp/cirrus-ci-build/build/../src/tools/testwrap --basedir /tmp/cirrus-ci-build/build --srcdir /tmp/cirrus-ci-build/src/test/recovery --pg-test-extra '' --testgroup recovery --testname 009_twophase -- /usr/bin/perl -I /tmp/cirrus-ci-build/src/test/perl -I /tmp/cirrus-ci-build/src/test/recovery /tmp/cirrus-ci-build/src/test/recovery/t/009_twophase.pl
[11:14:53.787] ――――――――――――――――――――――――――――――――――――― ✀  ―――――――――――――――――――――――――――――――――――――
[11:14:53.787] stderr:
[11:14:53.787] 
[11:14:53.787] (test program exited with status code 255)
[11:14:53.787] ――――――――――――――――――――――――――――――――――――――――――――――――――――――――――――――――――――――――――――――
[11:14:53.787] 
[11:14:54.221] ▶  13/323 pg_ctl stop failed                                                            ERROR         
[11:14:54.222]  13/323 postgresql:recovery / recovery/010_logical_decoding_timelines                   ERROR             1.86s   (exit status 255 or signal 127 SIGinvalid)
[11:14:54.222] >>> LD_LIBRARY_PATH=/tmp/cirrus-ci-build/build/tmp_install//usr/local/pgsql/lib/x86_64-linux-gnu enable_injection_points=yes MALLOC_PERTURB_=114 share_contrib_dir=/tmp/cirrus-ci-build/build/tmp_install//usr/local/pgsql/share/contrib PATH=/tmp/cirrus-ci-build/build/tmp_install//usr/local/pgsql/bin:/tmp/cirrus-ci-build/build/src/test/recovery:/tmp/cirrus-ci-build/build/src/test/recovery/test:/usr/local/sbin:/usr/local/bin:/usr/sbin:/usr/bin:/sbin:/bin REGRESS_SHLIB=/tmp/cirrus-ci-build/build/src/test/regress/regress.so PG_REGRESS=/tmp/cirrus-ci-build/build/src/test/regress/pg_regress INITDB_TEMPLATE=/tmp/cirrus-ci-build/build/tmp_install/initdb-template /usr/bin/python3 /tmp/cirrus-ci-build/build/../src/tools/testwrap --basedir /tmp/cirrus-ci-build/build --srcdir /tmp/cirrus-ci-build/src/test/recovery --pg-test-extra '' --testgroup recovery --testname 010_logical_decoding_timelines -- /usr/bin/perl -I /tmp/cirrus-ci-build/src/test/perl -I /tmp/cirrus-ci-build/src/test/recovery /tmp/cirrus-ci-build/src/test/recovery/t/010_logical_decoding_timelines.pl
[11:14:54.222] ――――――――――――――――――――――――――――――――――――― ✀  ―――――――――――――――――――――――――――――――――――――
[11:14:54.222] stderr:
[11:14:54.222] 
[11:14:54.222] (test program exited with status code 255)
[11:14:54.222] ――――――――――――――――――――――――――――――――――――――――――――――――――――――――――――――――――――――――――――――
[11:14:54.222] 
[11:14:55.969] ▶  14/323 pg_ctl stop failed                                                            ERROR         
[11:14:55.972]  14/323 postgresql:recovery / recovery/007_sync_rep                                     ERROR             4.93s   (exit status 255 or signal 127 SIGinvalid)
[11:14:55.973] >>> LD_LIBRARY_PATH=/tmp/cirrus-ci-build/build/tmp_install//usr/local/pgsql/lib/x86_64-linux-gnu enable_injection_points=yes MALLOC_PERTURB_=224 share_contrib_dir=/tmp/cirrus-ci-build/build/tmp_install//usr/local/pgsql/share/contrib PATH=/tmp/cirrus-ci-build/build/tmp_install//usr/local/pgsql/bin:/tmp/cirrus-ci-build/build/src/test/recovery:/tmp/cirrus-ci-build/build/src/test/recovery/test:/usr/local/sbin:/usr/local/bin:/usr/sbin:/usr/bin:/sbin:/bin REGRESS_SHLIB=/tmp/cirrus-ci-build/build/src/test/regress/regress.so PG_REGRESS=/tmp/cirrus-ci-build/build/src/test/regress/pg_regress INITDB_TEMPLATE=/tmp/cirrus-ci-build/build/tmp_install/initdb-template /usr/bin/python3 /tmp/cirrus-ci-build/build/../src/tools/testwrap --basedir /tmp/cirrus-ci-build/build --srcdir /tmp/cirrus-ci-build/src/test/recovery --pg-test-extra '' --testgroup recovery --testname 007_sync_rep -- /usr/bin/perl -I /tmp/cirrus-ci-build/src/test/perl -I /tmp/cirrus-ci-build/src/test/recovery /tmp/cirrus-ci-build/src/test/recovery/t/007_sync_rep.pl
[11:14:55.973] ――――――――――――――――――――――――――――――――――――― ✀  ―――――――――――――――――――――――――――――――――――――
[11:14:55.973] stderr:
[11:14:55.973] 
[11:14:55.973] (test program exited with status code 255)
[11:14:55.973] ――――――――――――――――――――――――――――――――――――――――――――――――――――――――――――――――――――――――――――――
[11:14:55.973] 
[11:14:56.017] ▶  15/323 pg_ctl stop failed                                                            ERROR         
[11:14:56.018]  15/323 postgresql:recovery / recovery/012_subtransactions                              ERROR             2.23s   (exit status 255 or signal 127 SIGinvalid)
[11:14:56.018] >>> LD_LIBRARY_PATH=/tmp/cirrus-ci-build/build/tmp_install//usr/local/pgsql/lib/x86_64-linux-gnu enable_injection_points=yes share_contrib_dir=/tmp/cirrus-ci-build/build/tmp_install//usr/local/pgsql/share/contrib PATH=/tmp/cirrus-ci-build/build/tmp_install//usr/local/pgsql/bin:/tmp/cirrus-ci-build/build/src/test/recovery:/tmp/cirrus-ci-build/build/src/test/recovery/test:/usr/local/sbin:/usr/local/bin:/usr/sbin:/usr/bin:/sbin:/bin REGRESS_SHLIB=/tmp/cirrus-ci-build/build/src/test/regress/regress.so PG_REGRESS=/tmp/cirrus-ci-build/build/src/test/regress/pg_regress INITDB_TEMPLATE=/tmp/cirrus-ci-build/build/tmp_install/initdb-template MALLOC_PERTURB_=235 /usr/bin/python3 /tmp/cirrus-ci-build/build/../src/tools/testwrap --basedir /tmp/cirrus-ci-build/build --srcdir /tmp/cirrus-ci-build/src/test/recovery --pg-test-extra '' --testgroup recovery --testname 012_subtransactions -- /usr/bin/perl -I /tmp/cirrus-ci-build/src/test/perl -I /tmp/cirrus-ci-build/src/test/recovery /tmp/cirrus-ci-build/src/test/recovery/t/012_subtransactions.pl
[11:14:56.018] ――――――――――――――――――――――――――――――――――――― ✀  ―――――――――――――――――――――――――――――――――――――
[11:14:56.018] stderr:
[11:14:56.018] 
[11:14:56.018] (test program exited with status code 255)
[11:14:56.018] ――――――――――――――――――――――――――――――――――――――――――――――――――――――――――――――――――――――――――――――
[11:14:56.018] 
[11:14:56.589]  16/323 postgresql:recovery / recovery/005_replay_delay                                 OK                7.92s   3 subtests passed
[11:14:59.129] ▶  17/323 pg_ctl stop failed                                                            ERROR         
[11:14:59.132]  17/323 postgresql:recovery / recovery/015_promotion_pages                              ERROR             3.11s   (exit status 255 or signal 127 SIGinvalid)
[11:14:59.132] >>> LD_LIBRARY_PATH=/tmp/cirrus-ci-build/build/tmp_install//usr/local/pgsql/lib/x86_64-linux-gnu enable_injection_points=yes MALLOC_PERTURB_=80 share_contrib_dir=/tmp/cirrus-ci-build/build/tmp_install//usr/local/pgsql/share/contrib PATH=/tmp/cirrus-ci-build/build/tmp_install//usr/local/pgsql/bin:/tmp/cirrus-ci-build/build/src/test/recovery:/tmp/cirrus-ci-build/build/src/test/recovery/test:/usr/local/sbin:/usr/local/bin:/usr/sbin:/usr/bin:/sbin:/bin REGRESS_SHLIB=/tmp/cirrus-ci-build/build/src/test/regress/regress.so PG_REGRESS=/tmp/cirrus-ci-build/build/src/test/regress/pg_regress INITDB_TEMPLATE=/tmp/cirrus-ci-build/build/tmp_install/initdb-template /usr/bin/python3 /tmp/cirrus-ci-build/build/../src/tools/testwrap --basedir /tmp/cirrus-ci-build/build --srcdir /tmp/cirrus-ci-build/src/test/recovery --pg-test-extra '' --testgroup recovery --testname 015_promotion_pages -- /usr/bin/perl -I /tmp/cirrus-ci-build/src/test/perl -I /tmp/cirrus-ci-build/src/test/recovery /tmp/cirrus-ci-build/src/test/recovery/t/015_promotion_pages.pl
[11:14:59.132] ――――――――――――――――――――――――――――――――――――― ✀  ―――――――――――――――――――――――――――――――――――――
[11:14:59.132] stderr:
[11:14:59.132] 
[11:14:59.132] (test program exited with status code 255)
[11:14:59.132] ――――――――――――――――――――――――――――――――――――――――――――――――――――――――――――――――――――――――――――――
[11:14:59.132] 
[11:14:59.745] ▶  18/323 pg_ctl stop failed                                                            ERROR         
[11:14:59.746]  18/323 postgresql:recovery / recovery/016_min_consistency                              ERROR             3.16s   (exit status 255 or signal 127 SIGinvalid)
[11:14:59.746] >>> LD_LIBRARY_PATH=/tmp/cirrus-ci-build/build/tmp_install//usr/local/pgsql/lib/x86_64-linux-gnu enable_injection_points=yes share_contrib_dir=/tmp/cirrus-ci-build/build/tmp_install//usr/local/pgsql/share/contrib PATH=/tmp/cirrus-ci-build/build/tmp_install//usr/local/pgsql/bin:/tmp/cirrus-ci-build/build/src/test/recovery:/tmp/cirrus-ci-build/build/src/test/recovery/test:/usr/local/sbin:/usr/local/bin:/usr/sbin:/usr/bin:/sbin:/bin REGRESS_SHLIB=/tmp/cirrus-ci-build/build/src/test/regress/regress.so PG_REGRESS=/tmp/cirrus-ci-build/build/src/test/regress/pg_regress MALLOC_PERTURB_=112 INITDB_TEMPLATE=/tmp/cirrus-ci-build/build/tmp_install/initdb-template /usr/bin/python3 /tmp/cirrus-ci-build/build/../src/tools/testwrap --basedir /tmp/cirrus-ci-build/build --srcdir /tmp/cirrus-ci-build/src/test/recovery --pg-test-extra '' --testgroup recovery --testname 016_min_consistency -- /usr/bin/perl -I /tmp/cirrus-ci-build/src/test/perl -I /tmp/cirrus-ci-build/src/test/recovery /tmp/cirrus-ci-build/src/test/recovery/t/016_min_consistency.pl
[11:14:59.746] ――――――――――――――――――――――――――――――――――――― ✀  ―――――――――――――――――――――――――――――――――――――
[11:14:59.746] stderr:
[11:14:59.746] 
[11:14:59.746] (test program exited with status code 255)
[11:14:59.746] ――――――――――――――――――――――――――――――――――――――――――――――――――――――――――――――――――――――――――――――
[11:14:59.746] 
[11:14:59.820] ▶  19/323 pg_ctl stop failed                                                            ERROR         
[11:14:59.829]  19/323 postgresql:recovery / recovery/014_unlogged_reinit                              ERROR             3.86s   (exit status 255 or signal 127 SIGinvalid)
[11:14:59.830] >>> LD_LIBRARY_PATH=/tmp/cirrus-ci-build/build/tmp_install//usr/local/pgsql/lib/x86_64-linux-gnu enable_injection_points=yes MALLOC_PERTURB_=50 share_contrib_dir=/tmp/cirrus-ci-build/build/tmp_install//usr/local/pgsql/share/contrib PATH=/tmp/cirrus-ci-build/build/tmp_install//usr/local/pgsql/bin:/tmp/cirrus-ci-build/build/src/test/recovery:/tmp/cirrus-ci-build/build/src/test/recovery/test:/usr/local/sbin:/usr/local/bin:/usr/sbin:/usr/bin:/sbin:/bin REGRESS_SHLIB=/tmp/cirrus-ci-build/build/src/test/regress/regress.so PG_REGRESS=/tmp/cirrus-ci-build/build/src/test/regress/pg_regress INITDB_TEMPLATE=/tmp/cirrus-ci-build/build/tmp_install/initdb-template /usr/bin/python3 /tmp/cirrus-ci-build/build/../src/tools/testwrap --basedir /tmp/cirrus-ci-build/build --srcdir /tmp/cirrus-ci-build/src/test/recovery --pg-test-extra '' --testgroup recovery --testname 014_unlogged_reinit -- /usr/bin/perl -I /tmp/cirrus-ci-build/src/test/perl -I /tmp/cirrus-ci-build/src/test/recovery /tmp/cirrus-ci-build/src/test/recovery/t/014_unlogged_reinit.pl
[11:14:59.830] ――――――――――――――――――――――――――――――――――――― ✀  ―――――――――――――――――――――――――――――――――――――
[11:14:59.830] stderr:
[11:14:59.830] 
[11:14:59.830] (test program exited with status code 255)
[11:14:59.830] ――――――――――――――――――――――――――――――――――――――――――――――――――――――――――――――――――――――――――――――
[11:14:59.830] 
[11:15:02.617] ▶  20/323 pg_ctl restart failed                                                         ERROR         
[11:15:02.617]  20/323 postgresql:recovery / recovery/017_shm                                          ERROR             3.48s   (exit status 255 or signal 127 SIGinvalid)
[11:15:02.617] >>> LD_LIBRARY_PATH=/tmp/cirrus-ci-build/build/tmp_install//usr/local/pgsql/lib/x86_64-linux-gnu enable_injection_points=yes share_contrib_dir=/tmp/cirrus-ci-build/build/tmp_install//usr/local/pgsql/share/contrib PATH=/tmp/cirrus-ci-build/build/tmp_install//usr/local/pgsql/bin:/tmp/cirrus-ci-build/build/src/test/recovery:/tmp/cirrus-ci-build/build/src/test/recovery/test:/usr/local/sbin:/usr/local/bin:/usr/sbin:/usr/bin:/sbin:/bin MALLOC_PERTURB_=71 REGRESS_SHLIB=/tmp/cirrus-ci-build/build/src/test/regress/regress.so PG_REGRESS=/tmp/cirrus-ci-build/build/src/test/regress/pg_regress INITDB_TEMPLATE=/tmp/cirrus-ci-build/build/tmp_install/initdb-template /usr/bin/python3 /tmp/cirrus-ci-build/build/../src/tools/testwrap --basedir /tmp/cirrus-ci-build/build --srcdir /tmp/cirrus-ci-build/src/test/recovery --pg-test-extra '' --testgroup recovery --testname 017_shm -- /usr/bin/perl -I /tmp/cirrus-ci-build/src/test/perl -I /tmp/cirrus-ci-build/src/test/recovery /tmp/cirrus-ci-build/src/test/recovery/t/017_shm.pl
[11:15:02.617] ――――――――――――――――――――――――――――――――――――― ✀  ―――――――――――――――――――――――――――――――――――――
[11:15:02.617] stderr:
[11:15:02.617] 
[11:15:02.617] (test program exited with status code 255)
[11:15:02.617] ――――――――――――――――――――――――――――――――――――――――――――――――――――――――――――――――――――――――――――――
[11:15:02.617] 
[11:15:02.950] ▶  21/323 pg_ctl stop failed                                                            ERROR         
[11:15:02.956]  21/323 postgresql:recovery / recovery/018_wal_optimize                                 ERROR             3.21s   (exit status 255 or signal 127 SIGinvalid)
[11:15:02.956] >>> LD_LIBRARY_PATH=/tmp/cirrus-ci-build/build/tmp_install//usr/local/pgsql/lib/x86_64-linux-gnu enable_injection_points=yes MALLOC_PERTURB_=166 share_contrib_dir=/tmp/cirrus-ci-build/build/tmp_install//usr/local/pgsql/share/contrib PATH=/tmp/cirrus-ci-build/build/tmp_install//usr/local/pgsql/bin:/tmp/cirrus-ci-build/build/src/test/recovery:/tmp/cirrus-ci-build/build/src/test/recovery/test:/usr/local/sbin:/usr/local/bin:/usr/sbin:/usr/bin:/sbin:/bin REGRESS_SHLIB=/tmp/cirrus-ci-build/build/src/test/regress/regress.so PG_REGRESS=/tmp/cirrus-ci-build/build/src/test/regress/pg_regress INITDB_TEMPLATE=/tmp/cirrus-ci-build/build/tmp_install/initdb-template /usr/bin/python3 /tmp/cirrus-ci-build/build/../src/tools/testwrap --basedir /tmp/cirrus-ci-build/build --srcdir /tmp/cirrus-ci-build/src/test/recovery --pg-test-extra '' --testgroup recovery --testname 018_wal_optimize -- /usr/bin/perl -I /tmp/cirrus-ci-build/src/test/perl -I /tmp/cirrus-ci-build/src/test/recovery /tmp/cirrus-ci-build/src/test/recovery/t/018_wal_optimize.pl
[11:15:02.956] ――――――――――――――――――――――――――――――――――――― ✀  ―――――――――――――――――――――――――――――――――――――
[11:15:02.956] stderr:
[11:15:02.956] 
[11:15:02.956] (test program exited with status code 255)
[11:15:02.956] ――――――――――――――――――――――――――――――――――――――――――――――――――――――――――――――――――――――――――――――
[11:15:02.956] 
[11:15:03.785] ▶  22/323 pg_ctl stop failed                                                            ERROR         
[11:15:03.788]  22/323 postgresql:recovery / recovery/020_archive_status                               ERROR             1.17s   (exit status 255 or signal 127 SIGinvalid)
[11:15:03.789] >>> LD_LIBRARY_PATH=/tmp/cirrus-ci-build/build/tmp_install//usr/local/pgsql/lib/x86_64-linux-gnu enable_injection_points=yes share_contrib_dir=/tmp/cirrus-ci-build/build/tmp_install//usr/local/pgsql/share/contrib PATH=/tmp/cirrus-ci-build/build/tmp_install//usr/local/pgsql/bin:/tmp/cirrus-ci-build/build/src/test/recovery:/tmp/cirrus-ci-build/build/src/test/recovery/test:/usr/local/sbin:/usr/local/bin:/usr/sbin:/usr/bin:/sbin:/bin MALLOC_PERTURB_=249 REGRESS_SHLIB=/tmp/cirrus-ci-build/build/src/test/regress/regress.so PG_REGRESS=/tmp/cirrus-ci-build/build/src/test/regress/pg_regress INITDB_TEMPLATE=/tmp/cirrus-ci-build/build/tmp_install/initdb-template /usr/bin/python3 /tmp/cirrus-ci-build/build/../src/tools/testwrap --basedir /tmp/cirrus-ci-build/build --srcdir /tmp/cirrus-ci-build/src/test/recovery --pg-test-extra '' --testgroup recovery --testname 020_archive_status -- /usr/bin/perl -I /tmp/cirrus-ci-build/src/test/perl -I /tmp/cirrus-ci-build/src/test/recovery /tmp/cirrus-ci-build/src/test/recovery/t/020_archive_status.pl
[11:15:03.789] ――――――――――――――――――――――――――――――――――――― ✀  ―――――――――――――――――――――――――――――――――――――
[11:15:03.789] stderr:
[11:15:03.789] 
[11:15:03.789] (test program exited with status code 255)
[11:15:03.789] ――――――――――――――――――――――――――――――――――――――――――――――――――――――――――――――――――――――――――――――
[11:15:03.789] 
[11:15:04.257] ▶  23/323 pg_ctl stop failed                                                            ERROR         
[11:15:04.261]  23/323 postgresql:recovery / recovery/019_replslot_limit                               ERROR             4.43s   (exit status 255 or signal 127 SIGinvalid)
[11:15:04.262] >>> LD_LIBRARY_PATH=/tmp/cirrus-ci-build/build/tmp_install//usr/local/pgsql/lib/x86_64-linux-gnu enable_injection_points=yes MALLOC_PERTURB_=166 share_contrib_dir=/tmp/cirrus-ci-build/build/tmp_install//usr/local/pgsql/share/contrib PATH=/tmp/cirrus-ci-build/build/tmp_install//usr/local/pgsql/bin:/tmp/cirrus-ci-build/build/src/test/recovery:/tmp/cirrus-ci-build/build/src/test/recovery/test:/usr/local/sbin:/usr/local/bin:/usr/sbin:/usr/bin:/sbin:/bin REGRESS_SHLIB=/tmp/cirrus-ci-build/build/src/test/regress/regress.so PG_REGRESS=/tmp/cirrus-ci-build/build/src/test/regress/pg_regress INITDB_TEMPLATE=/tmp/cirrus-ci-build/build/tmp_install/initdb-template /usr/bin/python3 /tmp/cirrus-ci-build/build/../src/tools/testwrap --basedir /tmp/cirrus-ci-build/build --srcdir /tmp/cirrus-ci-build/src/test/recovery --pg-test-extra '' --testgroup recovery --testname 019_replslot_limit -- /usr/bin/perl -I /tmp/cirrus-ci-build/src/test/perl -I /tmp/cirrus-ci-build/src/test/recovery /tmp/cirrus-ci-build/src/test/recovery/t/019_replslot_limit.pl
[11:15:04.262] ――――――――――――――――――――――――――――――――――――― ✀  ―――――――――――――――――――――――――――――――――――――
[11:15:04.262] stderr:
[11:15:04.262] 
[11:15:04.262] (test program exited with status code 255)
[11:15:04.262] ――――――――――――――――――――――――――――――――――――――――――――――――――――――――――――――――――――――――――――――
[11:15:04.262] 
[11:15:04.623] ▶  24/323 pg_ctl restart failed                                                         ERROR         
[11:15:04.624]  24/323 postgresql:recovery / recovery/008_fsm_truncation                               ERROR            13.39s   (exit status 255 or signal 127 SIGinvalid)
[11:15:04.625] >>> LD_LIBRARY_PATH=/tmp/cirrus-ci-build/build/tmp_install//usr/local/pgsql/lib/x86_64-linux-gnu MALLOC_PERTURB_=33 enable_injection_points=yes share_contrib_dir=/tmp/cirrus-ci-build/build/tmp_install//usr/local/pgsql/share/contrib PATH=/tmp/cirrus-ci-build/build/tmp_install//usr/local/pgsql/bin:/tmp/cirrus-ci-build/build/src/test/recovery:/tmp/cirrus-ci-build/build/src/test/recovery/test:/usr/local/sbin:/usr/local/bin:/usr/sbin:/usr/bin:/sbin:/bin REGRESS_SHLIB=/tmp/cirrus-ci-build/build/src/test/regress/regress.so PG_REGRESS=/tmp/cirrus-ci-build/build/src/test/regress/pg_regress INITDB_TEMPLATE=/tmp/cirrus-ci-build/build/tmp_install/initdb-template /usr/bin/python3 /tmp/cirrus-ci-build/build/../src/tools/testwrap --basedir /tmp/cirrus-ci-build/build --srcdir /tmp/cirrus-ci-build/src/test/recovery --pg-test-extra '' --testgroup recovery --testname 008_fsm_truncation -- /usr/bin/perl -I /tmp/cirrus-ci-build/src/test/perl -I /tmp/cirrus-ci-build/src/test/recovery /tmp/cirrus-ci-build/src/test/recovery/t/008_fsm_truncation.pl
[11:15:04.625] ――――――――――――――――――――――――――――――――――――― ✀  ―――――――――――――――――――――――――――――――――――――
[11:15:04.625] stderr:
[11:15:04.625] 
[11:15:04.625] (test program exited with status code 255)
[11:15:04.625] ――――――――――――――――――――――――――――――――――――――――――――――――――――――――――――――――――――――――――――――
[11:15:04.625] 
[11:15:07.224] ▶  25/323 pg_ctl restart failed                                                         ERROR         
[11:15:07.230]  25/323 postgresql:recovery / recovery/024_archive_recovery                             ERROR             2.60s   (exit status 255 or signal 127 SIGinvalid)
[11:15:07.230] >>> LD_LIBRARY_PATH=/tmp/cirrus-ci-build/build/tmp_install//usr/local/pgsql/lib/x86_64-linux-gnu enable_injection_points=yes share_contrib_dir=/tmp/cirrus-ci-build/build/tmp_install//usr/local/pgsql/share/contrib PATH=/tmp/cirrus-ci-build/build/tmp_install//usr/local/pgsql/bin:/tmp/cirrus-ci-build/build/src/test/recovery:/tmp/cirrus-ci-build/build/src/test/recovery/test:/usr/local/sbin:/usr/local/bin:/usr/sbin:/usr/bin:/sbin:/bin PG_REGRESS=/tmp/cirrus-ci-build/build/src/test/regress/pg_regress REGRESS_SHLIB=/tmp/cirrus-ci-build/build/src/test/regress/regress.so MALLOC_PERTURB_=220 INITDB_TEMPLATE=/tmp/cirrus-ci-build/build/tmp_install/initdb-template /usr/bin/python3 /tmp/cirrus-ci-build/build/../src/tools/testwrap --basedir /tmp/cirrus-ci-build/build --srcdir /tmp/cirrus-ci-build/src/test/recovery --pg-test-extra '' --testgroup recovery --testname 024_archive_recovery -- /usr/bin/perl -I /tmp/cirrus-ci-build/src/test/perl -I /tmp/cirrus-ci-build/src/test/recovery /tmp/cirrus-ci-build/src/test/recovery/t/024_archive_recovery.pl
[11:15:07.230] ――――――――――――――――――――――――――――――――――――― ✀  ―――――――――――――――――――――――――――――――――――――
[11:15:07.230] stderr:
[11:15:07.230] 
[11:15:07.230] (test program exited with status code 255)
[11:15:07.230] ――――――――――――――――――――――――――――――――――――――――――――――――――――――――――――――――――――――――――――――
[11:15:07.230] 
[11:15:09.134] ▶  26/323 pg_ctl stop failed                                                            ERROR         
[11:15:09.140]  26/323 postgresql:recovery / recovery/021_row_visibility                               ERROR             6.18s   (exit status 255 or signal 127 SIGinvalid)
[11:15:09.140] >>> LD_LIBRARY_PATH=/tmp/cirrus-ci-build/build/tmp_install//usr/local/pgsql/lib/x86_64-linux-gnu MALLOC_PERTURB_=247 enable_injection_points=yes share_contrib_dir=/tmp/cirrus-ci-build/build/tmp_install//usr/local/pgsql/share/contrib PATH=/tmp/cirrus-ci-build/build/tmp_install//usr/local/pgsql/bin:/tmp/cirrus-ci-build/build/src/test/recovery:/tmp/cirrus-ci-build/build/src/test/recovery/test:/usr/local/sbin:/usr/local/bin:/usr/sbin:/usr/bin:/sbin:/bin REGRESS_SHLIB=/tmp/cirrus-ci-build/build/src/test/regress/regress.so PG_REGRESS=/tmp/cirrus-ci-build/build/src/test/regress/pg_regress INITDB_TEMPLATE=/tmp/cirrus-ci-build/build/tmp_install/initdb-template /usr/bin/python3 /tmp/cirrus-ci-build/build/../src/tools/testwrap --basedir /tmp/cirrus-ci-build/build --srcdir /tmp/cirrus-ci-build/src/test/recovery --pg-test-extra '' --testgroup recovery --testname 021_row_visibility -- /usr/bin/perl -I /tmp/cirrus-ci-build/src/test/perl -I /tmp/cirrus-ci-build/src/test/recovery /tmp/cirrus-ci-build/src/test/recovery/t/021_row_visibility.pl
[11:15:09.140] ――――――――――――――――――――――――――――――――――――― ✀  ―――――――――――――――――――――――――――――――――――――
[11:15:09.140] stderr:
[11:15:09.140] 
[11:15:09.140] (test program exited with status code 255)
[11:15:09.140] ――――――――――――――――――――――――――――――――――――――――――――――――――――――――――――――――――――――――――――――
[11:15:09.140] 
[11:15:09.447] ▶  27/323 pg_ctl stop failed                                                            ERROR         
[11:15:09.453]  27/323 postgresql:recovery / recovery/023_pitr_prepared_xact                           ERROR             5.19s   (exit status 255 or signal 127 SIGinvalid)
[11:15:09.453] >>> LD_LIBRARY_PATH=/tmp/cirrus-ci-build/build/tmp_install//usr/local/pgsql/lib/x86_64-linux-gnu enable_injection_points=yes share_contrib_dir=/tmp/cirrus-ci-build/build/tmp_install//usr/local/pgsql/share/contrib PATH=/tmp/cirrus-ci-build/build/tmp_install//usr/local/pgsql/bin:/tmp/cirrus-ci-build/build/src/test/recovery:/tmp/cirrus-ci-build/build/src/test/recovery/test:/usr/local/sbin:/usr/local/bin:/usr/sbin:/usr/bin:/sbin:/bin MALLOC_PERTURB_=193 REGRESS_SHLIB=/tmp/cirrus-ci-build/build/src/test/regress/regress.so PG_REGRESS=/tmp/cirrus-ci-build/build/src/test/regress/pg_regress INITDB_TEMPLATE=/tmp/cirrus-ci-build/build/tmp_install/initdb-template /usr/bin/python3 /tmp/cirrus-ci-build/build/../src/tools/testwrap --basedir /tmp/cirrus-ci-build/build --srcdir /tmp/cirrus-ci-build/src/test/recovery --pg-test-extra '' --testgroup recovery --testname 023_pitr_prepared_xact -- /usr/bin/perl -I /tmp/cirrus-ci-build/src/test/perl -I /tmp/cirrus-ci-build/src/test/recovery /tmp/cirrus-ci-build/src/test/recovery/t/023_pitr_prepared_xact.pl
[11:15:09.453] ――――――――――――――――――――――――――――――――――――― ✀  ―――――――――――――――――――――――――――――――――――――
[11:15:09.453] stderr:
[11:15:09.453] 
[11:15:09.453] (test program exited with status code 255)
[11:15:09.453] ――――――――――――――――――――――――――――――――――――――――――――――――――――――――――――――――――――――――――――――
[11:15:09.453] 
[11:15:10.573]  28/323 postgresql:recovery / recovery/025_stuck_on_old_timeline                        OK                3.34s   1 subtests passed
[11:15:12.783] ▶  29/323 pg_ctl stop failed                                                            ERROR         
[11:15:12.784]  29/323 postgresql:recovery / recovery/028_pitr_timelines                               ERROR             2.21s   (exit status 255 or signal 127 SIGinvalid)
[11:15:12.784] >>> LD_LIBRARY_PATH=/tmp/cirrus-ci-build/build/tmp_install//usr/local/pgsql/lib/x86_64-linux-gnu MALLOC_PERTURB_=52 enable_injection_points=yes share_contrib_dir=/tmp/cirrus-ci-build/build/tmp_install//usr/local/pgsql/share/contrib PATH=/tmp/cirrus-ci-build/build/tmp_install//usr/local/pgsql/bin:/tmp/cirrus-ci-build/build/src/test/recovery:/tmp/cirrus-ci-build/build/src/test/recovery/test:/usr/local/sbin:/usr/local/bin:/usr/sbin:/usr/bin:/sbin:/bin REGRESS_SHLIB=/tmp/cirrus-ci-build/build/src/test/regress/regress.so PG_REGRESS=/tmp/cirrus-ci-build/build/src/test/regress/pg_regress INITDB_TEMPLATE=/tmp/cirrus-ci-build/build/tmp_install/initdb-template /usr/bin/python3 /tmp/cirrus-ci-build/build/../src/tools/testwrap --basedir /tmp/cirrus-ci-build/build --srcdir /tmp/cirrus-ci-build/src/test/recovery --pg-test-extra '' --testgroup recovery --testname 028_pitr_timelines -- /usr/bin/perl -I /tmp/cirrus-ci-build/src/test/perl -I /tmp/cirrus-ci-build/src/test/recovery /tmp/cirrus-ci-build/src/test/recovery/t/028_pitr_timelines.pl
[11:15:12.784] ――――――――――――――――――――――――――――――――――――― ✀  ―――――――――――――――――――――――――――――――――――――
[11:15:12.784] stderr:
[11:15:12.784] 
[11:15:12.784] (test program exited with status code 255)
[11:15:12.784] ――――――――――――――――――――――――――――――――――――――――――――――――――――――――――――――――――――――――――――――
[11:15:12.784] 
[11:15:14.821] ▶  30/323 pg_ctl stop failed                                                            ERROR         
[11:15:14.828]  30/323 postgresql:recovery / recovery/029_stats_restart                                ERROR             2.04s   (exit status 255 or signal 127 SIGinvalid)
[11:15:14.829] >>> LD_LIBRARY_PATH=/tmp/cirrus-ci-build/build/tmp_install//usr/local/pgsql/lib/x86_64-linux-gnu enable_injection_points=yes MALLOC_PERTURB_=66 share_contrib_dir=/tmp/cirrus-ci-build/build/tmp_install//usr/local/pgsql/share/contrib PATH=/tmp/cirrus-ci-build/build/tmp_install//usr/local/pgsql/bin:/tmp/cirrus-ci-build/build/src/test/recovery:/tmp/cirrus-ci-build/build/src/test/recovery/test:/usr/local/sbin:/usr/local/bin:/usr/sbin:/usr/bin:/sbin:/bin REGRESS_SHLIB=/tmp/cirrus-ci-build/build/src/test/regress/regress.so PG_REGRESS=/tmp/cirrus-ci-build/build/src/test/regress/pg_regress INITDB_TEMPLATE=/tmp/cirrus-ci-build/build/tmp_install/initdb-template /usr/bin/python3 /tmp/cirrus-ci-build/build/../src/tools/testwrap --basedir /tmp/cirrus-ci-build/build --srcdir /tmp/cirrus-ci-build/src/test/recovery --pg-test-extra '' --testgroup recovery --testname 029_stats_restart -- /usr/bin/perl -I /tmp/cirrus-ci-build/src/test/perl -I /tmp/cirrus-ci-build/src/test/recovery /tmp/cirrus-ci-build/src/test/recovery/t/029_stats_restart.pl
[11:15:14.829] ――――――――――――――――――――――――――――――――――――― ✀  ―――――――――――――――――――――――――――――――――――――
[11:15:14.829] stderr:
[11:15:14.829] 
[11:15:14.829] (test program exited with status code 255)
[11:15:14.829] ――――――――――――――――――――――――――――――――――――――――――――――――――――――――――――――――――――――――――――――
[11:15:14.829] 
[11:15:15.065] ▶  31/323 pg_ctl stop failed                                                            ERROR         
[11:15:15.067]  31/323 postgresql:recovery / recovery/026_overwrite_contrecord                         ERROR             5.93s   (exit status 255 or signal 127 SIGinvalid)
[11:15:15.068] >>> LD_LIBRARY_PATH=/tmp/cirrus-ci-build/build/tmp_install//usr/local/pgsql/lib/x86_64-linux-gnu enable_injection_points=yes MALLOC_PERTURB_=87 share_contrib_dir=/tmp/cirrus-ci-build/build/tmp_install//usr/local/pgsql/share/contrib PATH=/tmp/cirrus-ci-build/build/tmp_install//usr/local/pgsql/bin:/tmp/cirrus-ci-build/build/src/test/recovery:/tmp/cirrus-ci-build/build/src/test/recovery/test:/usr/local/sbin:/usr/local/bin:/usr/sbin:/usr/bin:/sbin:/bin REGRESS_SHLIB=/tmp/cirrus-ci-build/build/src/test/regress/regress.so PG_REGRESS=/tmp/cirrus-ci-build/build/src/test/regress/pg_regress INITDB_TEMPLATE=/tmp/cirrus-ci-build/build/tmp_install/initdb-template /usr/bin/python3 /tmp/cirrus-ci-build/build/../src/tools/testwrap --basedir /tmp/cirrus-ci-build/build --srcdir /tmp/cirrus-ci-build/src/test/recovery --pg-test-extra '' --testgroup recovery --testname 026_overwrite_contrecord -- /usr/bin/perl -I /tmp/cirrus-ci-build/src/test/perl -I /tmp/cirrus-ci-build/src/test/recovery /tmp/cirrus-ci-build/src/test/recovery/t/026_overwrite_contrecord.pl
[11:15:15.068] ――――――――――――――――――――――――――――――――――――― ✀  ―――――――――――――――――――――――――――――――――――――
[11:15:15.068] stderr:
[11:15:15.068] 
[11:15:15.068] (test program exited with status code 255)
[11:15:15.068] ――――――――――――――――――――――――――――――――――――――――――――――――――――――――――――――――――――――――――――――
[11:15:15.068] 
[11:15:21.256] ▶  32/323 pg_ctl restart failed                                                         ERROR         
[11:15:21.260]  32/323 postgresql:recovery / recovery/031_recovery_conflict                            ERROR             6.19s   (exit status 255 or signal 127 SIGinvalid)
[11:15:21.261] >>> LD_LIBRARY_PATH=/tmp/cirrus-ci-build/build/tmp_install//usr/local/pgsql/lib/x86_64-linux-gnu enable_injection_points=yes share_contrib_dir=/tmp/cirrus-ci-build/build/tmp_install//usr/local/pgsql/share/contrib PATH=/tmp/cirrus-ci-build/build/tmp_install//usr/local/pgsql/bin:/tmp/cirrus-ci-build/build/src/test/recovery:/tmp/cirrus-ci-build/build/src/test/recovery/test:/usr/local/sbin:/usr/local/bin:/usr/sbin:/usr/bin:/sbin:/bin MALLOC_PERTURB_=64 REGRESS_SHLIB=/tmp/cirrus-ci-build/build/src/test/regress/regress.so PG_REGRESS=/tmp/cirrus-ci-build/build/src/test/regress/pg_regress INITDB_TEMPLATE=/tmp/cirrus-ci-build/build/tmp_install/initdb-template /usr/bin/python3 /tmp/cirrus-ci-build/build/../src/tools/testwrap --basedir /tmp/cirrus-ci-build/build --srcdir /tmp/cirrus-ci-build/src/test/recovery --pg-test-extra '' --testgroup recovery --testname 031_recovery_conflict -- /usr/bin/perl -I /tmp/cirrus-ci-build/src/test/perl -I /tmp/cirrus-ci-build/src/test/recovery /tmp/cirrus-ci-build/src/test/recovery/t/031_recovery_conflict.pl
[11:15:21.261] ――――――――――――――――――――――――――――――――――――― ✀  ―――――――――――――――――――――――――――――――――――――
[11:15:21.261] stderr:
[11:15:21.261] 
[11:15:21.261] (test program exited with status code 255)
[11:15:21.261] ――――――――――――――――――――――――――――――――――――――――――――――――――――――――――――――――――――――――――――――
[11:15:21.261] 
[11:15:21.399] ▶  33/323 pg_ctl restart failed                                                         ERROR         
[11:15:21.400]  33/323 postgresql:recovery / recovery/030_stats_cleanup_replica                        ERROR             6.57s   (exit status 255 or signal 127 SIGinvalid)
[11:15:21.400] >>> LD_LIBRARY_PATH=/tmp/cirrus-ci-build/build/tmp_install//usr/local/pgsql/lib/x86_64-linux-gnu enable_injection_points=yes share_contrib_dir=/tmp/cirrus-ci-build/build/tmp_install//usr/local/pgsql/share/contrib PATH=/tmp/cirrus-ci-build/build/tmp_install//usr/local/pgsql/bin:/tmp/cirrus-ci-build/build/src/test/recovery:/tmp/cirrus-ci-build/build/src/test/recovery/test:/usr/local/sbin:/usr/local/bin:/usr/sbin:/usr/bin:/sbin:/bin MALLOC_PERTURB_=187 REGRESS_SHLIB=/tmp/cirrus-ci-build/build/src/test/regress/regress.so PG_REGRESS=/tmp/cirrus-ci-build/build/src/test/regress/pg_regress INITDB_TEMPLATE=/tmp/cirrus-ci-build/build/tmp_install/initdb-template /usr/bin/python3 /tmp/cirrus-ci-build/build/../src/tools/testwrap --basedir /tmp/cirrus-ci-build/build --srcdir /tmp/cirrus-ci-build/src/test/recovery --pg-test-extra '' --testgroup recovery --testname 030_stats_cleanup_replica -- /usr/bin/perl -I /tmp/cirrus-ci-build/src/test/perl -I /tmp/cirrus-ci-build/src/test/recovery /tmp/cirrus-ci-build/src/test/recovery/t/030_stats_cleanup_replica.pl
[11:15:21.400] ――――――――――――――――――――――――――――――――――――― ✀  ―――――――――――――――――――――――――――――――――――――
[11:15:21.400] stderr:
[11:15:21.400] 
[11:15:21.400] (test program exited with status code 255)
[11:15:21.400] ――――――――――――――――――――――――――――――――――――――――――――――――――――――――――――――――――――――――――――――
[11:15:21.400] 
[11:15:24.865] ▶  34/323 pg_ctl stop failed                                                            ERROR         
[11:15:24.865]  34/323 postgresql:recovery / recovery/033_replay_tsp_drops                             ERROR             3.46s   (exit status 255 or signal 127 SIGinvalid)
[11:15:24.866] >>> LD_LIBRARY_PATH=/tmp/cirrus-ci-build/build/tmp_install//usr/local/pgsql/lib/x86_64-linux-gnu MALLOC_PERTURB_=94 enable_injection_points=yes share_contrib_dir=/tmp/cirrus-ci-build/build/tmp_install//usr/local/pgsql/share/contrib PATH=/tmp/cirrus-ci-build/build/tmp_install//usr/local/pgsql/bin:/tmp/cirrus-ci-build/build/src/test/recovery:/tmp/cirrus-ci-build/build/src/test/recovery/test:/usr/local/sbin:/usr/local/bin:/usr/sbin:/usr/bin:/sbin:/bin REGRESS_SHLIB=/tmp/cirrus-ci-build/build/src/test/regress/regress.so PG_REGRESS=/tmp/cirrus-ci-build/build/src/test/regress/pg_regress INITDB_TEMPLATE=/tmp/cirrus-ci-build/build/tmp_install/initdb-template /usr/bin/python3 /tmp/cirrus-ci-build/build/../src/tools/testwrap --basedir /tmp/cirrus-ci-build/build --srcdir /tmp/cirrus-ci-build/src/test/recovery --pg-test-extra '' --testgroup recovery --testname 033_replay_tsp_drops -- /usr/bin/perl -I /tmp/cirrus-ci-build/src/test/perl -I /tmp/cirrus-ci-build/src/test/recovery /tmp/cirrus-ci-build/src/test/recovery/t/033_replay_tsp_drops.pl
[11:15:24.866] ――――――――――――――――――――――――――――――――――――― ✀  ―――――――――――――――――――――――――――――――――――――
[11:15:24.866] stderr:
[11:15:24.866] 
[11:15:24.866] (test program exited with status code 255)
[11:15:24.866] ――――――――――――――――――――――――――――――――――――――――――――――――――――――――――――――――――――――――――――――
[11:15:24.866] 
[11:15:28.333] ▶  35/323 pg_ctl stop failed                                                            ERROR         
[11:15:28.338]  35/323 postgresql:recovery / recovery/032_relfilenode_reuse                            ERROR             7.08s   (exit status 255 or signal 127 SIGinvalid)
[11:15:28.338] >>> MALLOC_PERTURB_=177 LD_LIBRARY_PATH=/tmp/cirrus-ci-build/build/tmp_install//usr/local/pgsql/lib/x86_64-linux-gnu enable_injection_points=yes share_contrib_dir=/tmp/cirrus-ci-build/build/tmp_install//usr/local/pgsql/share/contrib PATH=/tmp/cirrus-ci-build/build/tmp_install//usr/local/pgsql/bin:/tmp/cirrus-ci-build/build/src/test/recovery:/tmp/cirrus-ci-build/build/src/test/recovery/test:/usr/local/sbin:/usr/local/bin:/usr/sbin:/usr/bin:/sbin:/bin REGRESS_SHLIB=/tmp/cirrus-ci-build/build/src/test/regress/regress.so PG_REGRESS=/tmp/cirrus-ci-build/build/src/test/regress/pg_regress INITDB_TEMPLATE=/tmp/cirrus-ci-build/build/tmp_install/initdb-template /usr/bin/python3 /tmp/cirrus-ci-build/build/../src/tools/testwrap --basedir /tmp/cirrus-ci-build/build --srcdir /tmp/cirrus-ci-build/src/test/recovery --pg-test-extra '' --testgroup recovery --testname 032_relfilenode_reuse -- /usr/bin/perl -I /tmp/cirrus-ci-build/src/test/perl -I /tmp/cirrus-ci-build/src/test/recovery /tmp/cirrus-ci-build/src/test/recovery/t/032_relfilenode_reuse.pl
[11:15:28.338] ――――――――――――――――――――――――――――――――――――― ✀  ―――――――――――――――――――――――――――――――――――――
[11:15:28.338] stderr:
[11:15:28.338] 
[11:15:28.338] (test program exited with status code 255)
[11:15:28.338] ――――――――――――――――――――――――――――――――――――――――――――――――――――――――――――――――――――――――――――――
[11:15:28.338] 
[11:15:28.397] ▶  36/323 pg_ctl stop failed                                                            ERROR         
[11:15:28.398]  36/323 postgresql:recovery / recovery/034_create_database                              ERROR             3.53s   (exit status 255 or signal 127 SIGinvalid)
[11:15:28.398] >>> MALLOC_PERTURB_=74 LD_LIBRARY_PATH=/tmp/cirrus-ci-build/build/tmp_install//usr/local/pgsql/lib/x86_64-linux-gnu enable_injection_points=yes share_contrib_dir=/tmp/cirrus-ci-build/build/tmp_install//usr/local/pgsql/share/contrib PATH=/tmp/cirrus-ci-build/build/tmp_install//usr/local/pgsql/bin:/tmp/cirrus-ci-build/build/src/test/recovery:/tmp/cirrus-ci-build/build/src/test/recovery/test:/usr/local/sbin:/usr/local/bin:/usr/sbin:/usr/bin:/sbin:/bin REGRESS_SHLIB=/tmp/cirrus-ci-build/build/src/test/regress/regress.so PG_REGRESS=/tmp/cirrus-ci-build/build/src/test/regress/pg_regress INITDB_TEMPLATE=/tmp/cirrus-ci-build/build/tmp_install/initdb-template /usr/bin/python3 /tmp/cirrus-ci-build/build/../src/tools/testwrap --basedir /tmp/cirrus-ci-build/build --srcdir /tmp/cirrus-ci-build/src/test/recovery --pg-test-extra '' --testgroup recovery --testname 034_create_database -- /usr/bin/perl -I /tmp/cirrus-ci-build/src/test/perl -I /tmp/cirrus-ci-build/src/test/recovery /tmp/cirrus-ci-build/src/test/recovery/t/034_create_database.pl
[11:15:28.398] ――――――――――――――――――――――――――――――――――――― ✀  ―――――――――――――――――――――――――――――――――――――
[11:15:28.398] stderr:
[11:15:28.398] 
[11:15:28.398] (test program exited with status code 255)
[11:15:28.398] ――――――――――――――――――――――――――――――――――――――――――――――――――――――――――――――――――――――――――――――
[11:15:28.398] 
[11:15:30.820] ▶  37/323 pg_ctl stop failed                                                            ERROR         
[11:15:30.825]  37/323 postgresql:recovery / recovery/036_truncated_dropped                            ERROR             2.43s   (exit status 255 or signal 127 SIGinvalid)
[11:15:30.825] >>> LD_LIBRARY_PATH=/tmp/cirrus-ci-build/build/tmp_install//usr/local/pgsql/lib/x86_64-linux-gnu enable_injection_points=yes share_contrib_dir=/tmp/cirrus-ci-build/build/tmp_install//usr/local/pgsql/share/contrib PATH=/tmp/cirrus-ci-build/build/tmp_install//usr/local/pgsql/bin:/tmp/cirrus-ci-build/build/src/test/recovery:/tmp/cirrus-ci-build/build/src/test/recovery/test:/usr/local/sbin:/usr/local/bin:/usr/sbin:/usr/bin:/sbin:/bin REGRESS_SHLIB=/tmp/cirrus-ci-build/build/src/test/regress/regress.so PG_REGRESS=/tmp/cirrus-ci-build/build/src/test/regress/pg_regress INITDB_TEMPLATE=/tmp/cirrus-ci-build/build/tmp_install/initdb-template MALLOC_PERTURB_=235 /usr/bin/python3 /tmp/cirrus-ci-build/build/../src/tools/testwrap --basedir /tmp/cirrus-ci-build/build --srcdir /tmp/cirrus-ci-build/src/test/recovery --pg-test-extra '' --testgroup recovery --testname 036_truncated_dropped -- /usr/bin/perl -I /tmp/cirrus-ci-build/src/test/perl -I /tmp/cirrus-ci-build/src/test/recovery /tmp/cirrus-ci-build/src/test/recovery/t/036_truncated_dropped.pl
[11:15:30.825] ――――――――――――――――――――――――――――――――――――― ✀  ―――――――――――――――――――――――――――――――――――――
[11:15:30.825] stderr:
[11:15:30.825] 
[11:15:30.825] (test program exited with status code 255)
[11:15:30.825] ――――――――――――――――――――――――――――――――――――――――――――――――――――――――――――――――――――――――――――――
[11:15:30.825] 
[11:15:36.356]  38/323 postgresql:recovery / recovery/037_invalid_database                             OK                5.53s   10 subtests passed
[11:15:39.185] ▶  39/323 pg_ctl stop failed                                                            ERROR         
[11:15:39.189]  39/323 postgresql:recovery / recovery/035_standby_logical_decoding                     ERROR            10.85s   (exit status 255 or signal 127 SIGinvalid)
[11:15:39.190] >>> LD_LIBRARY_PATH=/tmp/cirrus-ci-build/build/tmp_install//usr/local/pgsql/lib/x86_64-linux-gnu enable_injection_points=yes MALLOC_PERTURB_=99 share_contrib_dir=/tmp/cirrus-ci-build/build/tmp_install//usr/local/pgsql/share/contrib PATH=/tmp/cirrus-ci-build/build/tmp_install//usr/local/pgsql/bin:/tmp/cirrus-ci-build/build/src/test/recovery:/tmp/cirrus-ci-build/build/src/test/recovery/test:/usr/local/sbin:/usr/local/bin:/usr/sbin:/usr/bin:/sbin:/bin REGRESS_SHLIB=/tmp/cirrus-ci-build/build/src/test/regress/regress.so PG_REGRESS=/tmp/cirrus-ci-build/build/src/test/regress/pg_regress INITDB_TEMPLATE=/tmp/cirrus-ci-build/build/tmp_install/initdb-template /usr/bin/python3 /tmp/cirrus-ci-build/build/../src/tools/testwrap --basedir /tmp/cirrus-ci-build/build --srcdir /tmp/cirrus-ci-build/src/test/recovery --pg-test-extra '' --testgroup recovery --testname 035_standby_logical_decoding -- /usr/bin/perl -I /tmp/cirrus-ci-build/src/test/perl -I /tmp/cirrus-ci-build/src/test/recovery /tmp/cirrus-ci-build/src/test/recovery/t/035_standby_logical_decoding.pl
[11:15:39.190] ――――――――――――――――――――――――――――――――――――― ✀  ―――――――――――――――――――――――――――――――――――――
[11:15:39.190] stderr:
[11:15:39.190] 
[11:15:39.190] (test program exited with status code 255)
[11:15:39.190] ――――――――――――――――――――――――――――――――――――――――――――――――――――――――――――――――――――――――――――――
[11:15:39.190] 
[11:15:41.833] ▶  40/323 pg_ctl restart failed                                                         ERROR         
[11:15:41.835]  40/323 postgresql:recovery / recovery/038_save_logical_slots_shutdown                  ERROR             5.48s   (exit status 255 or signal 127 SIGinvalid)
[11:15:41.835] >>> LD_LIBRARY_PATH=/tmp/cirrus-ci-build/build/tmp_install//usr/local/pgsql/lib/x86_64-linux-gnu enable_injection_points=yes share_contrib_dir=/tmp/cirrus-ci-build/build/tmp_install//usr/local/pgsql/share/contrib PATH=/tmp/cirrus-ci-build/build/tmp_install//usr/local/pgsql/bin:/tmp/cirrus-ci-build/build/src/test/recovery:/tmp/cirrus-ci-build/build/src/test/recovery/test:/usr/local/sbin:/usr/local/bin:/usr/sbin:/usr/bin:/sbin:/bin MALLOC_PERTURB_=64 REGRESS_SHLIB=/tmp/cirrus-ci-build/build/src/test/regress/regress.so PG_REGRESS=/tmp/cirrus-ci-build/build/src/test/regress/pg_regress INITDB_TEMPLATE=/tmp/cirrus-ci-build/build/tmp_install/initdb-template /usr/bin/python3 /tmp/cirrus-ci-build/build/../src/tools/testwrap --basedir /tmp/cirrus-ci-build/build --srcdir /tmp/cirrus-ci-build/src/test/recovery --pg-test-extra '' --testgroup recovery --testname 038_save_logical_slots_shutdown -- /usr/bin/perl -I /tmp/cirrus-ci-build/src/test/perl -I /tmp/cirrus-ci-build/src/test/recovery /tmp/cirrus-ci-build/src/test/recovery/t/038_save_logical_slots_shutdown.pl
[11:15:41.835] ――――――――――――――――――――――――――――――――――――― ✀  ―――――――――――――――――――――――――――――――――――――
[11:15:41.835] stderr:
[11:15:41.835] 
[11:15:41.835] (test program exited with status code 255)
[11:15:41.835] ――――――――――――――――――――――――――――――――――――――――――――――――――――――――――――――――――――――――――――――
[11:15:41.835] 
[11:15:42.458] ▶  41/323 pg_ctl stop failed                                                            ERROR         
[11:15:42.459]  41/323 postgresql:recovery / recovery/039_end_of_wal                                   ERROR             3.27s   (exit status 255 or signal 127 SIGinvalid)
[11:15:42.460] >>> LD_LIBRARY_PATH=/tmp/cirrus-ci-build/build/tmp_install//usr/local/pgsql/lib/x86_64-linux-gnu MALLOC_PERTURB_=126 enable_injection_points=yes share_contrib_dir=/tmp/cirrus-ci-build/build/tmp_install//usr/local/pgsql/share/contrib PATH=/tmp/cirrus-ci-build/build/tmp_install//usr/local/pgsql/bin:/tmp/cirrus-ci-build/build/src/test/recovery:/tmp/cirrus-ci-build/build/src/test/recovery/test:/usr/local/sbin:/usr/local/bin:/usr/sbin:/usr/bin:/sbin:/bin REGRESS_SHLIB=/tmp/cirrus-ci-build/build/src/test/regress/regress.so PG_REGRESS=/tmp/cirrus-ci-build/build/src/test/regress/pg_regress INITDB_TEMPLATE=/tmp/cirrus-ci-build/build/tmp_install/initdb-template /usr/bin/python3 /tmp/cirrus-ci-build/build/../src/tools/testwrap --basedir /tmp/cirrus-ci-build/build --srcdir /tmp/cirrus-ci-build/src/test/recovery --pg-test-extra '' --testgroup recovery --testname 039_end_of_wal -- /usr/bin/perl -I /tmp/cirrus-ci-build/src/test/perl -I /tmp/cirrus-ci-build/src/test/recovery /tmp/cirrus-ci-build/src/test/recovery/t/039_end_of_wal.pl
[11:15:42.460] ――――――――――――――――――――――――――――――――――――― ✀  ―――――――――――――――――――――――――――――――――――――
[11:15:42.460] stderr:
[11:15:42.460] 
[11:15:42.460] (test program exited with status code 255)
[11:15:42.460] ――――――――――――――――――――――――――――――――――――――――――――――――――――――――――――――――――――――――――――――
[11:15:42.460] 
[11:15:44.785] ▶  42/323 pg_ctl stop failed                                                            ERROR         
[11:15:44.786]  42/323 postgresql:recovery / recovery/041_checkpoint_at_promote                        ERROR             2.33s   (exit status 255 or signal 127 SIGinvalid)
[11:15:44.787] >>> LD_LIBRARY_PATH=/tmp/cirrus-ci-build/build/tmp_install//usr/local/pgsql/lib/x86_64-linux-gnu enable_injection_points=yes share_contrib_dir=/tmp/cirrus-ci-build/build/tmp_install//usr/local/pgsql/share/contrib PATH=/tmp/cirrus-ci-build/build/tmp_install//usr/local/pgsql/bin:/tmp/cirrus-ci-build/build/src/test/recovery:/tmp/cirrus-ci-build/build/src/test/recovery/test:/usr/local/sbin:/usr/local/bin:/usr/sbin:/usr/bin:/sbin:/bin REGRESS_SHLIB=/tmp/cirrus-ci-build/build/src/test/regress/regress.so PG_REGRESS=/tmp/cirrus-ci-build/build/src/test/regress/pg_regress INITDB_TEMPLATE=/tmp/cirrus-ci-build/build/tmp_install/initdb-template MALLOC_PERTURB_=148 /usr/bin/python3 /tmp/cirrus-ci-build/build/../src/tools/testwrap --basedir /tmp/cirrus-ci-build/build --srcdir /tmp/cirrus-ci-build/src/test/recovery --pg-test-extra '' --testgroup recovery --testname 041_checkpoint_at_promote -- /usr/bin/perl -I /tmp/cirrus-ci-build/src/test/perl -I /tmp/cirrus-ci-build/src/test/recovery /tmp/cirrus-ci-build/src/test/recovery/t/041_checkpoint_at_promote.pl
[11:15:44.787] ――――――――――――――――――――――――――――――――――――― ✀  ―――――――――――――――――――――――――――――――――――――
[11:15:44.787] stderr:
[11:15:44.787] 
[11:15:44.787] (test program exited with status code 255)
[11:15:44.787] ――――――――――――――――――――――――――――――――――――――――――――――――――――――――――――――――――――――――――――――
[11:15:44.787] 
[11:15:49.466] ▶  43/323 pg_ctl stop failed                                                            ERROR         
[11:15:49.467]  43/323 postgresql:recovery / recovery/042_low_level_backup                             ERROR             4.68s   (exit status 255 or signal 127 SIGinvalid)
[11:15:49.467] >>> LD_LIBRARY_PATH=/tmp/cirrus-ci-build/build/tmp_install//usr/local/pgsql/lib/x86_64-linux-gnu enable_injection_points=yes INITDB_TEMPLATE=/tmp/cirrus-ci-build/build/tmp_install/initdb-template share_contrib_dir=/tmp/cirrus-ci-build/build/tmp_install//usr/local/pgsql/share/contrib PATH=/tmp/cirrus-ci-build/build/tmp_install//usr/local/pgsql/bin:/tmp/cirrus-ci-build/build/src/test/recovery:/tmp/cirrus-ci-build/build/src/test/recovery/test:/usr/local/sbin:/usr/local/bin:/usr/sbin:/usr/bin:/sbin:/bin REGRESS_SHLIB=/tmp/cirrus-ci-build/build/src/test/regress/regress.so PG_REGRESS=/tmp/cirrus-ci-build/build/src/test/regress/pg_regress MALLOC_PERTURB_=6 /usr/bin/python3 /tmp/cirrus-ci-build/build/../src/tools/testwrap --basedir /tmp/cirrus-ci-build/build --srcdir /tmp/cirrus-ci-build/src/test/recovery --pg-test-extra '' --testgroup recovery --testname 042_low_level_backup -- /usr/bin/perl -I /tmp/cirrus-ci-build/src/test/perl -I /tmp/cirrus-ci-build/src/test/recovery /tmp/cirrus-ci-build/src/test/recovery/t/042_low_level_backup.pl
[11:15:49.467] ――――――――――――――――――――――――――――――――――――― ✀  ―――――――――――――――――――――――――――――――――――――
[11:15:49.467] stderr:
[11:15:49.467] 
[11:15:49.467] (test program exited with status code 255)
[11:15:49.467] ――――――――――――――――――――――――――――――――――――――――――――――――――――――――――――――――――――――――――――――
[11:15:49.467] 
[11:15:50.848] ▶  44/323 pg_ctl stop failed                                                            ERROR         
[11:15:50.859]  44/323 postgresql:recovery / recovery/043_no_contrecord_switch                         ERROR             1.39s   (exit status 255 or signal 127 SIGinvalid)
[11:15:50.859] >>> MALLOC_PERTURB_=216 LD_LIBRARY_PATH=/tmp/cirrus-ci-build/build/tmp_install//usr/local/pgsql/lib/x86_64-linux-gnu enable_injection_points=yes share_contrib_dir=/tmp/cirrus-ci-build/build/tmp_install//usr/local/pgsql/share/contrib PATH=/tmp/cirrus-ci-build/build/tmp_install//usr/local/pgsql/bin:/tmp/cirrus-ci-build/build/src/test/recovery:/tmp/cirrus-ci-build/build/src/test/recovery/test:/usr/local/sbin:/usr/local/bin:/usr/sbin:/usr/bin:/sbin:/bin REGRESS_SHLIB=/tmp/cirrus-ci-build/build/src/test/regress/regress.so PG_REGRESS=/tmp/cirrus-ci-build/build/src/test/regress/pg_regress INITDB_TEMPLATE=/tmp/cirrus-ci-build/build/tmp_install/initdb-template /usr/bin/python3 /tmp/cirrus-ci-build/build/../src/tools/testwrap --basedir /tmp/cirrus-ci-build/build --srcdir /tmp/cirrus-ci-build/src/test/recovery --pg-test-extra '' --testgroup recovery --testname 043_no_contrecord_switch -- /usr/bin/perl -I /tmp/cirrus-ci-build/src/test/perl -I /tmp/cirrus-ci-build/src/test/recovery /tmp/cirrus-ci-build/src/test/recovery/t/043_no_contrecord_switch.pl
[11:15:50.859] ――――――――――――――――――――――――――――――――――――― ✀  ―――――――――――――――――――――――――――――――――――――
[11:15:50.859] stderr:
[11:15:50.859] 
[11:15:50.859] (test program exited with status code 255)
[11:15:50.859] ――――――――――――――――――――――――――――――――――――――――――――――――――――――――――――――――――――――――――――――
[11:15:50.859] 
[11:15:51.901] ▶  45/323 pg_ctl stop failed                                                            ERROR         
[11:15:51.902]  45/323 postgresql:recovery / recovery/040_standby_failover_slots_sync                  ERROR            10.07s   (exit status 255 or signal 127 SIGinvalid)
[11:15:51.903] >>> LD_LIBRARY_PATH=/tmp/cirrus-ci-build/build/tmp_install//usr/local/pgsql/lib/x86_64-linux-gnu enable_injection_points=yes share_contrib_dir=/tmp/cirrus-ci-build/build/tmp_install//usr/local/pgsql/share/contrib PATH=/tmp/cirrus-ci-build/build/tmp_install//usr/local/pgsql/bin:/tmp/cirrus-ci-build/build/src/test/recovery:/tmp/cirrus-ci-build/build/src/test/recovery/test:/usr/local/sbin:/usr/local/bin:/usr/sbin:/usr/bin:/sbin:/bin MALLOC_PERTURB_=73 REGRESS_SHLIB=/tmp/cirrus-ci-build/build/src/test/regress/regress.so PG_REGRESS=/tmp/cirrus-ci-build/build/src/test/regress/pg_regress INITDB_TEMPLATE=/tmp/cirrus-ci-build/build/tmp_install/initdb-template /usr/bin/python3 /tmp/cirrus-ci-build/build/../src/tools/testwrap --basedir /tmp/cirrus-ci-build/build --srcdir /tmp/cirrus-ci-build/src/test/recovery --pg-test-extra '' --testgroup recovery --testname 040_standby_failover_slots_sync -- /usr/bin/perl -I /tmp/cirrus-ci-build/src/test/perl -I /tmp/cirrus-ci-build/src/test/recovery /tmp/cirrus-ci-build/src/test/recovery/t/040_standby_failover_slots_sync.pl
[11:15:51.903] ――――――――――――――――――――――――――――――――――――― ✀  ―――――――――――――――――――――――――――――――――――――
[11:15:51.903] stderr:
[11:15:51.903] 
[11:15:51.903] (test program exited with status code 255)
[11:15:51.903] ――――――――――――――――――――――――――――――――――――――――――――――――――――――――――――――――――――――――――――――
[11:15:51.903] 
[11:15:56.684] ▶  46/323 pg_ctl restart failed                                                         ERROR         
[11:15:56.689]  46/323 postgresql:kerberos / kerberos/001_auth                                         ERROR             5.83s   (exit status 255 or signal 127 SIGinvalid)
[11:15:56.690] >>> with_krb_srvnam=postgres LD_LIBRARY_PATH=/tmp/cirrus-ci-build/build/tmp_install//usr/local/pgsql/lib/x86_64-linux-gnu share_contrib_dir=/tmp/cirrus-ci-build/build/tmp_install//usr/local/pgsql/share/contrib MALLOC_PERTURB_=154 with_gssapi=yes REGRESS_SHLIB=/tmp/cirrus-ci-build/build/src/test/regress/regress.so PG_REGRESS=/tmp/cirrus-ci-build/build/src/test/regress/pg_regress PATH=/tmp/cirrus-ci-build/build/tmp_install//usr/local/pgsql/bin:/tmp/cirrus-ci-build/build/src/test/kerberos:/tmp/cirrus-ci-build/build/src/test/kerberos/test:/usr/local/sbin:/usr/local/bin:/usr/sbin:/usr/bin:/sbin:/bin INITDB_TEMPLATE=/tmp/cirrus-ci-build/build/tmp_install/initdb-template /usr/bin/python3 /tmp/cirrus-ci-build/build/../src/tools/testwrap --basedir /tmp/cirrus-ci-build/build --srcdir /tmp/cirrus-ci-build/src/test/kerberos --pg-test-extra '' --testgroup kerberos --testname 001_auth -- /usr/bin/perl -I /tmp/cirrus-ci-build/src/test/perl -I /tmp/cirrus-ci-build/src/test/kerberos /tmp/cirrus-ci-build/src/test/kerberos/t/001_auth.pl
[11:15:56.690] ――――――――――――――――――――――――――――――――――――― ✀  ―――――――――――――――――――――――――――――――――――――
[11:15:56.690] stderr:
[11:15:56.690] 
[11:15:56.690] (test program exited with status code 255)
[11:15:56.690] ――――――――――――――――――――――――――――――――――――――――――――――――――――――――――――――――――――――――――――――
[11:15:56.690] 
[11:16:05.447] ▶  47/323 pg_ctl stop failed                                                            ERROR         
[11:16:05.448]  47/323 postgresql:pg_upgrade / pg_upgrade/002_pg_upgrade                               ERROR            79.22s   (exit status 255 or signal 127 SIGinvalid)
[11:16:05.448] >>> LD_LIBRARY_PATH=/tmp/cirrus-ci-build/build/tmp_install//usr/local/pgsql/lib/x86_64-linux-gnu MALLOC_PERTURB_=87 share_contrib_dir=/tmp/cirrus-ci-build/build/tmp_install//usr/local/pgsql/share/contrib PATH=/tmp/cirrus-ci-build/build/tmp_install//usr/local/pgsql/bin:/tmp/cirrus-ci-build/build/src/bin/pg_upgrade:/tmp/cirrus-ci-build/build/src/bin/pg_upgrade/test:/usr/local/sbin:/usr/local/bin:/usr/sbin:/usr/bin:/sbin:/bin with_icu=yes REGRESS_SHLIB=/tmp/cirrus-ci-build/build/src/test/regress/regress.so PG_REGRESS=/tmp/cirrus-ci-build/build/src/test/regress/pg_regress INITDB_TEMPLATE=/tmp/cirrus-ci-build/build/tmp_install/initdb-template /usr/bin/python3 /tmp/cirrus-ci-build/build/../src/tools/testwrap --basedir /tmp/cirrus-ci-build/build --srcdir /tmp/cirrus-ci-build/src/bin/pg_upgrade --pg-test-extra '' --testgroup pg_upgrade --testname 002_pg_upgrade -- /usr/bin/perl -I /tmp/cirrus-ci-build/src/test/perl -I /tmp/cirrus-ci-build/src/bin/pg_upgrade /tmp/cirrus-ci-build/src/bin/pg_upgrade/t/002_pg_upgrade.pl
[11:16:05.448] ――――――――――――――――――――――――――――――――――――― ✀  ―――――――――――――――――――――――――――――――――――――
[11:16:05.448] stderr:
[11:16:05.448] 
[11:16:05.448] (test program exited with status code 255)
[11:16:05.448] ――――――――――――――――――――――――――――――――――――――――――――――――――――――――――――――――――――――――――――――
[11:16:05.448] 
[11:16:12.837] ▶  48/323 pg_ctl restart failed                                                         ERROR         
[11:16:12.841]  48/323 postgresql:recovery / recovery/027_stream_regress                               ERROR            63.39s   (exit status 255 or signal 127 SIGinvalid)
[11:16:12.841] >>> LD_LIBRARY_PATH=/tmp/cirrus-ci-build/build/tmp_install//usr/local/pgsql/lib/x86_64-linux-gnu enable_injection_points=yes share_contrib_dir=/tmp/cirrus-ci-build/build/tmp_install//usr/local/pgsql/share/contrib PATH=/tmp/cirrus-ci-build/build/tmp_install//usr/local/pgsql/bin:/tmp/cirrus-ci-build/build/src/test/recovery:/tmp/cirrus-ci-build/build/src/test/recovery/test:/usr/local/sbin:/usr/local/bin:/usr/sbin:/usr/bin:/sbin:/bin MALLOC_PERTURB_=153 REGRESS_SHLIB=/tmp/cirrus-ci-build/build/src/test/regress/regress.so PG_REGRESS=/tmp/cirrus-ci-build/build/src/test/regress/pg_regress INITDB_TEMPLATE=/tmp/cirrus-ci-build/build/tmp_install/initdb-template /usr/bin/python3 /tmp/cirrus-ci-build/build/../src/tools/testwrap --basedir /tmp/cirrus-ci-build/build --srcdir /tmp/cirrus-ci-build/src/test/recovery --pg-test-extra '' --testgroup recovery --testname 027_stream_regress -- /usr/bin/perl -I /tmp/cirrus-ci-build/src/test/perl -I /tmp/cirrus-ci-build/src/test/recovery /tmp/cirrus-ci-build/src/test/recovery/t/027_stream_regress.pl
[11:16:12.841] ――――――――――――――――――――――――――――――――――――― ✀  ―――――――――――――――――――――――――――――――――――――
[11:16:12.841] stderr:
[11:16:12.841] 
[11:16:12.841] (test program exited with status code 255)
[11:16:12.841] ――――――――――――――――――――――――――――――――――――――――――――――――――――――――――――――――――――――――――――――
[11:16:12.841] 
[11:17:47.031] ▶  49/323 # test failed                                                                 ERROR         
[11:17:47.036]  49/323 postgresql:isolation / isolation/isolation                                      ERROR           180.77s   exit status 2
[11:17:47.036] >>> LD_LIBRARY_PATH=/tmp/cirrus-ci-build/build/tmp_install//usr/local/pgsql/lib/x86_64-linux-gnu MALLOC_PERTURB_=191 PATH=/tmp/cirrus-ci-build/build/tmp_install//usr/local/pgsql/bin:/tmp/cirrus-ci-build/build/src/test/isolation:/usr/local/sbin:/usr/local/bin:/usr/sbin:/usr/bin:/sbin:/bin REGRESS_SHLIB=/tmp/cirrus-ci-build/build/src/test/regress/regress.so PG_REGRESS=/tmp/cirrus-ci-build/build/src/test/regress/pg_regress INITDB_TEMPLATE=/tmp/cirrus-ci-build/build/tmp_install/initdb-template /usr/bin/python3 /tmp/cirrus-ci-build/build/../src/tools/testwrap --basedir /tmp/cirrus-ci-build/build --srcdir /tmp/cirrus-ci-build/src/test/isolation --pg-test-extra '' --testgroup isolation --testname isolation -- /tmp/cirrus-ci-build/build/src/test/isolation/pg_isolation_regress --inputdir /tmp/cirrus-ci-build/src/test/isolation --expecteddir /tmp/cirrus-ci-build/src/test/isolation --bindir '' --dlpath /tmp/cirrus-ci-build/build/src/test/isolation --max-concurrent-tests=20 --dbname isolation_regression --outputdir /tmp/cirrus-ci-build/build/testrun/isolation/isolation --temp-instance /tmp/cirrus-ci-build/build/testrun/isolation/isolation/tmp_check --port 40053 --schedule /tmp/cirrus-ci-build/build/../src/test/isolation/isolation_schedule
[11:17:47.036] ――――――――――――――――――――――――――――――――――――― ✀  ―――――――――――――――――――――――――――――――――――――
[11:17:47.036] stderr:
[11:17:47.036] pg_ctl: server does not shut down
[11:17:47.036] # could not stop postmaster: exit code was 256
[11:17:47.036] 
[11:17:47.036] (test program exited with status code 2)
[11:17:47.036] ――――――――――――――――――――――――――――――――――――――――――――――――――――――――――――――――――――――――――――――
[11:17:47.036] 
[11:17:50.606] ▶  50/323 # test failed                                                                 ERROR         
[11:17:50.612]  50/323 postgresql:regress / regress/regress                                            ERROR           184.39s   exit status 2
[11:17:50.612] >>> LD_LIBRARY_PATH=/tmp/cirrus-ci-build/build/tmp_install//usr/local/pgsql/lib/x86_64-linux-gnu MALLOC_PERTURB_=93 PATH=/tmp/cirrus-ci-build/build/tmp_install//usr/local/pgsql/bin:/tmp/cirrus-ci-build/build/src/test/regress:/usr/local/sbin:/usr/local/bin:/usr/sbin:/usr/bin:/sbin:/bin REGRESS_SHLIB=/tmp/cirrus-ci-build/build/src/test/regress/regress.so PG_REGRESS=/tmp/cirrus-ci-build/build/src/test/regress/pg_regress INITDB_TEMPLATE=/tmp/cirrus-ci-build/build/tmp_install/initdb-template /usr/bin/python3 /tmp/cirrus-ci-build/build/../src/tools/testwrap --basedir /tmp/cirrus-ci-build/build --srcdir /tmp/cirrus-ci-build/src/test/regress --pg-test-extra '' --testgroup regress --testname regress -- /tmp/cirrus-ci-build/build/src/test/regress/pg_regress --inputdir /tmp/cirrus-ci-build/src/test/regress --expecteddir /tmp/cirrus-ci-build/src/test/regress --bindir '' --dlpath /tmp/cirrus-ci-build/build/src/test/regress --max-concurrent-tests=20 --dbname regression --outputdir /tmp/cirrus-ci-build/build/testrun/regress/regress --temp-instance /tmp/cirrus-ci-build/build/testrun/regress/regress/tmp_check --port 40052 --schedule /tmp/cirrus-ci-build/build/../src/test/regress/parallel_schedule
[11:17:50.612] ――――――――――――――――――――――――――――――――――――― ✀  ―――――――――――――――――――――――――――――――――――――
[11:17:50.612] stderr:
[11:17:50.612] pg_ctl: server does not shut down
[11:17:50.612] # could not stop postmaster: exit code was 256
[11:17:50.612] 
[11:17:50.612] (test program exited with status code 2)
[11:17:50.612] ――――――――――――――――――――――――――――――――――――――――――――――――――――――――――――――――――――――――――――――
[11:17:50.612] 
[11:17:54.834] ▶  51/323 # test failed                                                                 ERROR         
[11:17:54.840]  51/323 postgresql:plpgsql / plpgsql/regress                                            ERROR           122.94s   exit status 2
[11:17:54.840] >>> LD_LIBRARY_PATH=/tmp/cirrus-ci-build/build/tmp_install//usr/local/pgsql/lib/x86_64-linux-gnu REGRESS_SHLIB=/tmp/cirrus-ci-build/build/src/test/regress/regress.so PG_REGRESS=/tmp/cirrus-ci-build/build/src/test/regress/pg_regress PATH=/tmp/cirrus-ci-build/build/tmp_install//usr/local/pgsql/bin:/tmp/cirrus-ci-build/build/src/pl/plpgsql/src:/usr/local/sbin:/usr/local/bin:/usr/sbin:/usr/bin:/sbin:/bin INITDB_TEMPLATE=/tmp/cirrus-ci-build/build/tmp_install/initdb-template MALLOC_PERTURB_=186 /usr/bin/python3 /tmp/cirrus-ci-build/build/../src/tools/testwrap --basedir /tmp/cirrus-ci-build/build --srcdir /tmp/cirrus-ci-build/src/pl/plpgsql/src --pg-test-extra '' --testgroup plpgsql --testname regress -- /tmp/cirrus-ci-build/build/src/test/regress/pg_regress --inputdir /tmp/cirrus-ci-build/src/pl/plpgsql/src --expecteddir /tmp/cirrus-ci-build/src/pl/plpgsql/src --bindir '' --dlpath /tmp/cirrus-ci-build/build/src/pl/plpgsql/src --max-concurrent-tests=20 --dbname regression_plpgsql --outputdir /tmp/cirrus-ci-build/build/testrun/plpgsql/regress --temp-instance /tmp/cirrus-ci-build/build/testrun/plpgsql/regress/tmp_check --port 40000 plpgsql_array plpgsql_cache plpgsql_call plpgsql_control plpgsql_copy plpgsql_domain plpgsql_misc plpgsql_record plpgsql_simple plpgsql_transaction plpgsql_trap plpgsql_trigger plpgsql_varprops
[11:17:54.840] ――――――――――――――――――――――――――――――――――――― ✀  ―――――――――――――――――――――――――――――――――――――
[11:17:54.840] stderr:
[11:17:54.840] pg_ctl: server does not shut down
[11:17:54.840] # could not stop postmaster: exit code was 256
[11:17:54.840] 
[11:17:54.840] (test program exited with status code 2)
[11:17:54.840] ――――――――――――――――――――――――――――――――――――――――――――――――――――――――――――――――――――――――――――――
[11:17:54.840] 
[11:17:58.638] ▶  52/323 # test failed                                                                 ERROR         
[11:17:58.643]  52/323 postgresql:plperl / plperl/regress                                              ERROR           121.95s   exit status 2
[11:17:58.643] >>> MALLOC_PERTURB_=84 LD_LIBRARY_PATH=/tmp/cirrus-ci-build/build/tmp_install//usr/local/pgsql/lib/x86_64-linux-gnu PATH=/tmp/cirrus-ci-build/build/tmp_install//usr/local/pgsql/bin:/tmp/cirrus-ci-build/build/src/pl/plperl:/usr/local/sbin:/usr/local/bin:/usr/sbin:/usr/bin:/sbin:/bin REGRESS_SHLIB=/tmp/cirrus-ci-build/build/src/test/regress/regress.so PG_REGRESS=/tmp/cirrus-ci-build/build/src/test/regress/pg_regress INITDB_TEMPLATE=/tmp/cirrus-ci-build/build/tmp_install/initdb-template /usr/bin/python3 /tmp/cirrus-ci-build/build/../src/tools/testwrap --basedir /tmp/cirrus-ci-build/build --srcdir /tmp/cirrus-ci-build/src/pl/plperl --pg-test-extra '' --testgroup plperl --testname regress -- /tmp/cirrus-ci-build/build/src/test/regress/pg_regress --inputdir /tmp/cirrus-ci-build/src/pl/plperl --expecteddir /tmp/cirrus-ci-build/src/pl/plperl --bindir '' --dlpath /tmp/cirrus-ci-build/build/src/pl/plperl --max-concurrent-tests=20 --dbname regression_plperl --dlpath /tmp/cirrus-ci-build/build/src/test/regress --outputdir /tmp/cirrus-ci-build/build/testrun/plperl/regress --temp-instance /tmp/cirrus-ci-build/build/testrun/plperl/regress/tmp_check --port 40001 plperl_setup plperl plperl_lc plperl_trigger plperl_shared plperl_elog plperl_util plperl_init plperlu plperl_array plperl_call plperl_transaction plperl_env
[11:17:58.643] ――――――――――――――――――――――――――――――――――――― ✀  ―――――――――――――――――――――――――――――――――――――
[11:17:58.643] stderr:
[11:17:58.643] pg_ctl: server does not shut down
[11:17:58.643] # could not stop postmaster: exit code was 256
[11:17:58.643] 
[11:17:58.643] (test program exited with status code 2)
[11:17:58.643] ――――――――――――――――――――――――――――――――――――――――――――――――――――――――――――――――――――――――――――――
[11:17:58.643] 
[11:18:08.032] ▶  53/323 # test failed                                                                 ERROR         
[11:18:08.037]  53/323 postgresql:plpython / plpython/regress                                          ERROR           122.59s   exit status 2
[11:18:08.038] >>> PATH=/tmp/cirrus-ci-build/build/tmp_install//usr/local/pgsql/bin:/tmp/cirrus-ci-build/build/src/pl/plpython:/usr/local/sbin:/usr/local/bin:/usr/sbin:/usr/bin:/sbin:/bin LD_LIBRARY_PATH=/tmp/cirrus-ci-build/build/tmp_install//usr/local/pgsql/lib/x86_64-linux-gnu MALLOC_PERTURB_=135 REGRESS_SHLIB=/tmp/cirrus-ci-build/build/src/test/regress/regress.so PG_REGRESS=/tmp/cirrus-ci-build/build/src/test/regress/pg_regress INITDB_TEMPLATE=/tmp/cirrus-ci-build/build/tmp_install/initdb-template /usr/bin/python3 /tmp/cirrus-ci-build/build/../src/tools/testwrap --basedir /tmp/cirrus-ci-build/build --srcdir /tmp/cirrus-ci-build/src/pl/plpython --pg-test-extra '' --testgroup plpython --testname regress -- /tmp/cirrus-ci-build/build/src/test/regress/pg_regress --inputdir /tmp/cirrus-ci-build/src/pl/plpython --expecteddir /tmp/cirrus-ci-build/src/pl/plpython --bindir '' --dlpath /tmp/cirrus-ci-build/build/src/pl/plpython --max-concurrent-tests=20 --dbname regression_plpython --outputdir /tmp/cirrus-ci-build/build/testrun/plpython/regress --temp-instance /tmp/cirrus-ci-build/build/testrun/plpython/regress/tmp_check --port 40002 plpython_schema plpython_populate plpython_test plpython_do plpython_global plpython_import plpython_spi plpython_newline plpython_void plpython_call plpython_params plpython_setof plpython_record plpython_trigger plpython_types plpython_error plpython_ereport plpython_unicode plpython_quote plpython_composite plpython_subtransaction plpython_transaction plpython_drop
[11:18:08.038] ――――――――――――――――――――――――――――――――――――― ✀  ―――――――――――――――――――――――――――――――――――――
[11:18:08.038] stderr:
[11:18:08.038] pg_ctl: server does not shut down
[11:18:08.038] # could not stop postmaster: exit code was 256
[11:18:08.038] 
[11:18:08.038] (test program exited with status code 2)
[11:18:08.038] ――――――――――――――――――――――――――――――――――――――――――――――――――――――――――――――――――――――――――――――
[11:18:08.038] 
[11:18:13.647] ▶  54/323 # test failed                                                                 ERROR         
[11:18:13.651]  54/323 postgresql:pltcl / pltcl/regress                                                ERROR           120.81s   exit status 2
[11:18:13.651] >>> MALLOC_PERTURB_=115 LD_LIBRARY_PATH=/tmp/cirrus-ci-build/build/tmp_install//usr/local/pgsql/lib/x86_64-linux-gnu REGRESS_SHLIB=/tmp/cirrus-ci-build/build/src/test/regress/regress.so PG_REGRESS=/tmp/cirrus-ci-build/build/src/test/regress/pg_regress PATH=/tmp/cirrus-ci-build/build/tmp_install//usr/local/pgsql/bin:/tmp/cirrus-ci-build/build/src/pl/tcl:/usr/local/sbin:/usr/local/bin:/usr/sbin:/usr/bin:/sbin:/bin INITDB_TEMPLATE=/tmp/cirrus-ci-build/build/tmp_install/initdb-template /usr/bin/python3 /tmp/cirrus-ci-build/build/../src/tools/testwrap --basedir /tmp/cirrus-ci-build/build --srcdir /tmp/cirrus-ci-build/src/pl/tcl --pg-test-extra '' --testgroup pltcl --testname regress -- /tmp/cirrus-ci-build/build/src/test/regress/pg_regress --inputdir /tmp/cirrus-ci-build/src/pl/tcl --expecteddir /tmp/cirrus-ci-build/src/pl/tcl --bindir '' --dlpath /tmp/cirrus-ci-build/build/src/pl/tcl --max-concurrent-tests=20 --dbname regression_pltcl --load-extension=pltcl --outputdir /tmp/cirrus-ci-build/build/testrun/pltcl/regress --temp-instance /tmp/cirrus-ci-build/build/testrun/pltcl/regress/tmp_check --port 40003 pltcl_setup pltcl_queries pltcl_trigger pltcl_call pltcl_start_proc pltcl_subxact pltcl_unicode pltcl_transaction
[11:18:13.651] ――――――――――――――――――――――――――――――――――――― ✀  ―――――――――――――――――――――――――――――――――――――
[11:18:13.651] stderr:
[11:18:13.651] pg_ctl: server does not shut down
[11:18:13.651] # could not stop postmaster: exit code was 256
[11:18:13.651] 
[11:18:13.651] (test program exited with status code 2)
[11:18:13.651] ――――――――――――――――――――――――――――――――――――――――――――――――――――――――――――――――――――――――――――――
[11:18:13.651] 
[11:18:26.167]  55/323 postgresql:recovery / recovery/013_crash_restart                                ERROR           211.94s   exit status 29
[11:18:26.167] >>> LD_LIBRARY_PATH=/tmp/cirrus-ci-build/build/tmp_install//usr/local/pgsql/lib/x86_64-linux-gnu enable_injection_points=yes share_contrib_dir=/tmp/cirrus-ci-build/build/tmp_install//usr/local/pgsql/share/contrib PATH=/tmp/cirrus-ci-build/build/tmp_install//usr/local/pgsql/bin:/tmp/cirrus-ci-build/build/src/test/recovery:/tmp/cirrus-ci-build/build/src/test/recovery/test:/usr/local/sbin:/usr/local/bin:/usr/sbin:/usr/bin:/sbin:/bin MALLOC_PERTURB_=5 REGRESS_SHLIB=/tmp/cirrus-ci-build/build/src/test/regress/regress.so PG_REGRESS=/tmp/cirrus-ci-build/build/src/test/regress/pg_regress INITDB_TEMPLATE=/tmp/cirrus-ci-build/build/tmp_install/initdb-template /usr/bin/python3 /tmp/cirrus-ci-build/build/../src/tools/testwrap --basedir /tmp/cirrus-ci-build/build --srcdir /tmp/cirrus-ci-build/src/test/recovery --pg-test-extra '' --testgroup recovery --testname 013_crash_restart -- /usr/bin/perl -I /tmp/cirrus-ci-build/src/test/perl -I /tmp/cirrus-ci-build/src/test/recovery /tmp/cirrus-ci-build/src/test/recovery/t/013_crash_restart.pl
[11:18:26.167] ――――――――――――――――――――――――――――――――――――― ✀  ―――――――――――――――――――――――――――――――――――――
[11:18:26.167] stderr:
[11:18:26.167] # Tests were run but no plan was declared and done_testing() was not seen.
[11:18:26.167] # Looks like your test exited with 29 just after 6.
[11:18:26.167] 
[11:18:26.167] (test program exited with status code 29)
[11:18:26.167] ――――――――――――――――――――――――――――――――――――――――――――――――――――――――――――――――――――――――――――――
[11:18:26.167] 
[11:18:35.282]  56/323 postgresql:recovery / recovery/022_crash_temp_files                             ERROR           211.49s   exit status 29
[11:18:35.282] >>> LD_LIBRARY_PATH=/tmp/cirrus-ci-build/build/tmp_install//usr/local/pgsql/lib/x86_64-linux-gnu enable_injection_points=yes share_contrib_dir=/tmp/cirrus-ci-build/build/tmp_install//usr/local/pgsql/share/contrib PATH=/tmp/cirrus-ci-build/build/tmp_install//usr/local/pgsql/bin:/tmp/cirrus-ci-build/build/src/test/recovery:/tmp/cirrus-ci-build/build/src/test/recovery/test:/usr/local/sbin:/usr/local/bin:/usr/sbin:/usr/bin:/sbin:/bin MALLOC_PERTURB_=157 REGRESS_SHLIB=/tmp/cirrus-ci-build/build/src/test/regress/regress.so PG_REGRESS=/tmp/cirrus-ci-build/build/src/test/regress/pg_regress INITDB_TEMPLATE=/tmp/cirrus-ci-build/build/tmp_install/initdb-template /usr/bin/python3 /tmp/cirrus-ci-build/build/../src/tools/testwrap --basedir /tmp/cirrus-ci-build/build --srcdir /tmp/cirrus-ci-build/src/test/recovery --pg-test-extra '' --testgroup recovery --testname 022_crash_temp_files -- /usr/bin/perl -I /tmp/cirrus-ci-build/src/test/perl -I /tmp/cirrus-ci-build/src/test/recovery /tmp/cirrus-ci-build/src/test/recovery/t/022_crash_temp_files.pl
[11:18:35.282] ――――――――――――――――――――――――――――――――――――― ✀  ―――――――――――――――――――――――――――――――――――――
[11:18:35.282] stderr:
[11:18:35.282] # Tests were run but no plan was declared and done_testing() was not seen.
[11:18:35.282] # Looks like your test exited with 29 just after 4.
[11:18:35.282] 
[11:18:35.282] (test program exited with status code 29)
[11:18:35.282] ――――――――――――――――――――――――――――――――――――――――――――――――――――――――――――――――――――――――――――――
[11:18:35.282] 
[11:19:50.341] ▶  57/323 # test failed                                                                 ERROR         
[11:19:50.346]  57/323 postgresql:amcheck / amcheck/regress                                            ERROR           123.31s   exit status 2
[11:19:50.346] >>> LD_LIBRARY_PATH=/tmp/cirrus-ci-build/build/tmp_install//usr/local/pgsql/lib/x86_64-linux-gnu PATH=/tmp/cirrus-ci-build/build/tmp_install//usr/local/pgsql/bin:/tmp/cirrus-ci-build/build/contrib/amcheck:/usr/local/sbin:/usr/local/bin:/usr/sbin:/usr/bin:/sbin:/bin REGRESS_SHLIB=/tmp/cirrus-ci-build/build/src/test/regress/regress.so PG_REGRESS=/tmp/cirrus-ci-build/build/src/test/regress/pg_regress INITDB_TEMPLATE=/tmp/cirrus-ci-build/build/tmp_install/initdb-template MALLOC_PERTURB_=19 /usr/bin/python3 /tmp/cirrus-ci-build/build/../src/tools/testwrap --basedir /tmp/cirrus-ci-build/build --srcdir /tmp/cirrus-ci-build/contrib/amcheck --pg-test-extra '' --testgroup amcheck --testname regress -- /tmp/cirrus-ci-build/build/src/test/regress/pg_regress --inputdir /tmp/cirrus-ci-build/contrib/amcheck --expecteddir /tmp/cirrus-ci-build/contrib/amcheck --bindir '' --dlpath /tmp/cirrus-ci-build/build/contrib/amcheck --max-concurrent-tests=20 --dbname regression_amcheck --outputdir /tmp/cirrus-ci-build/build/testrun/amcheck/regress --temp-instance /tmp/cirrus-ci-build/build/testrun/amcheck/regress/tmp_check --port 40004 check check_btree check_heap
[11:19:50.346] ――――――――――――――――――――――――――――――――――――― ✀  ―――――――――――――――――――――――――――――――――――――
[11:19:50.346] stderr:
[11:19:50.346] pg_ctl: server does not shut down
[11:19:50.346] # could not stop postmaster: exit code was 256
[11:19:50.346] 
[11:19:50.346] (test program exited with status code 2)
[11:19:50.346] ――――――――――――――――――――――――――――――――――――――――――――――――――――――――――――――――――――――――――――――
[11:19:50.346] 
[11:19:51.171] ▶  58/323 # test failed                                                                 ERROR         
[11:19:51.175]  58/323 postgresql:basic_archive / basic_archive/regress                                ERROR           120.56s   exit status 2
[11:19:51.176] >>> PATH=/tmp/cirrus-ci-build/build/tmp_install//usr/local/pgsql/bin:/tmp/cirrus-ci-build/build/contrib/basic_archive:/usr/local/sbin:/usr/local/bin:/usr/sbin:/usr/bin:/sbin:/bin LD_LIBRARY_PATH=/tmp/cirrus-ci-build/build/tmp_install//usr/local/pgsql/lib/x86_64-linux-gnu MALLOC_PERTURB_=68 REGRESS_SHLIB=/tmp/cirrus-ci-build/build/src/test/regress/regress.so PG_REGRESS=/tmp/cirrus-ci-build/build/src/test/regress/pg_regress INITDB_TEMPLATE=/tmp/cirrus-ci-build/build/tmp_install/initdb-template /usr/bin/python3 /tmp/cirrus-ci-build/build/../src/tools/testwrap --basedir /tmp/cirrus-ci-build/build --srcdir /tmp/cirrus-ci-build/contrib/basic_archive --pg-test-extra '' --testgroup basic_archive --testname regress -- /tmp/cirrus-ci-build/build/src/test/regress/pg_regress --inputdir /tmp/cirrus-ci-build/contrib/basic_archive --expecteddir /tmp/cirrus-ci-build/contrib/basic_archive --bindir '' --dlpath /tmp/cirrus-ci-build/build/contrib/basic_archive --max-concurrent-tests=20 --dbname regression_basic_archive --temp-config /tmp/cirrus-ci-build/build/../contrib/basic_archive/basic_archive.conf --outputdir /tmp/cirrus-ci-build/build/testrun/basic_archive/regress --temp-instance /tmp/cirrus-ci-build/build/testrun/basic_archive/regress/tmp_check --port 40005 basic_archive
[11:19:51.176] ――――――――――――――――――――――――――――――――――――― ✀  ―――――――――――――――――――――――――――――――――――――
[11:19:51.176] stderr:
[11:19:51.176] pg_ctl: server does not shut down
[11:19:51.176] # could not stop postmaster: exit code was 256
[11:19:51.176] 
[11:19:51.176] (test program exited with status code 2)
[11:19:51.176] ――――――――――――――――――――――――――――――――――――――――――――――――――――――――――――――――――――――――――――――
[11:19:51.176] 
[11:19:55.366] ▶  59/323 # test failed                                                                 ERROR         
[11:19:55.371]  59/323 postgresql:bloom / bloom/regress                                                ERROR           120.53s   exit status 2
[11:19:55.371] >>> LD_LIBRARY_PATH=/tmp/cirrus-ci-build/build/tmp_install//usr/local/pgsql/lib/x86_64-linux-gnu INITDB_TEMPLATE=/tmp/cirrus-ci-build/build/tmp_install/initdb-template MALLOC_PERTURB_=12 REGRESS_SHLIB=/tmp/cirrus-ci-build/build/src/test/regress/regress.so PG_REGRESS=/tmp/cirrus-ci-build/build/src/test/regress/pg_regress PATH=/tmp/cirrus-ci-build/build/tmp_install//usr/local/pgsql/bin:/tmp/cirrus-ci-build/build/contrib/bloom:/usr/local/sbin:/usr/local/bin:/usr/sbin:/usr/bin:/sbin:/bin /usr/bin/python3 /tmp/cirrus-ci-build/build/../src/tools/testwrap --basedir /tmp/cirrus-ci-build/build --srcdir /tmp/cirrus-ci-build/contrib/bloom --pg-test-extra '' --testgroup bloom --testname regress -- /tmp/cirrus-ci-build/build/src/test/regress/pg_regress --inputdir /tmp/cirrus-ci-build/contrib/bloom --expecteddir /tmp/cirrus-ci-build/contrib/bloom --bindir '' --dlpath /tmp/cirrus-ci-build/build/contrib/bloom --max-concurrent-tests=20 --dbname regression_bloom --outputdir /tmp/cirrus-ci-build/build/testrun/bloom/regress --temp-instance /tmp/cirrus-ci-build/build/testrun/bloom/regress/tmp_check --port 40006 bloom
[11:19:55.371] ――――――――――――――――――――――――――――――――――――― ✀  ―――――――――――――――――――――――――――――――――――――
[11:19:55.371] stderr:
[11:19:55.371] pg_ctl: server does not shut down
[11:19:55.371] # could not stop postmaster: exit code was 256
[11:19:55.371] 
[11:19:55.371] (test program exited with status code 2)
[11:19:55.371] ――――――――――――――――――――――――――――――――――――――――――――――――――――――――――――――――――――――――――――――
[11:19:55.371] 
[11:19:59.112] ▶  60/323 # test failed                                                                 ERROR         
[11:19:59.117]  60/323 postgresql:bool_plperl / bool_plperl/regress                                    ERROR           120.47s   exit status 2
[11:19:59.117] >>> LD_LIBRARY_PATH=/tmp/cirrus-ci-build/build/tmp_install//usr/local/pgsql/lib/x86_64-linux-gnu PATH=/tmp/cirrus-ci-build/build/tmp_install//usr/local/pgsql/bin:/tmp/cirrus-ci-build/build/contrib/bool_plperl:/usr/local/sbin:/usr/local/bin:/usr/sbin:/usr/bin:/sbin:/bin MALLOC_PERTURB_=75 REGRESS_SHLIB=/tmp/cirrus-ci-build/build/src/test/regress/regress.so PG_REGRESS=/tmp/cirrus-ci-build/build/src/test/regress/pg_regress INITDB_TEMPLATE=/tmp/cirrus-ci-build/build/tmp_install/initdb-template /usr/bin/python3 /tmp/cirrus-ci-build/build/../src/tools/testwrap --basedir /tmp/cirrus-ci-build/build --srcdir /tmp/cirrus-ci-build/contrib/bool_plperl --pg-test-extra '' --testgroup bool_plperl --testname regress -- /tmp/cirrus-ci-build/build/src/test/regress/pg_regress --inputdir /tmp/cirrus-ci-build/contrib/bool_plperl --expecteddir /tmp/cirrus-ci-build/contrib/bool_plperl --bindir '' --dlpath /tmp/cirrus-ci-build/build/contrib/bool_plperl --max-concurrent-tests=20 --dbname regression_bool_plperl --outputdir /tmp/cirrus-ci-build/build/testrun/bool_plperl/regress --temp-instance /tmp/cirrus-ci-build/build/testrun/bool_plperl/regress/tmp_check --port 40007 bool_plperl bool_plperlu
[11:19:59.117] ――――――――――――――――――――――――――――――――――――― ✀  ―――――――――――――――――――――――――――――――――――――
[11:19:59.117] stderr:
[11:19:59.117] pg_ctl: server does not shut down
[11:19:59.117] # could not stop postmaster: exit code was 256
[11:19:59.117] 
[11:19:59.117] (test program exited with status code 2)
[11:19:59.117] ――――――――――――――――――――――――――――――――――――――――――――――――――――――――――――――――――――――――――――――
[11:19:59.117] 
[11:20:09.277] ▶  61/323 # test failed                                                                 ERROR         
[11:20:09.282]  61/323 postgresql:btree_gin / btree_gin/regress                                        ERROR           121.24s   exit status 2
[11:20:09.282] >>> LD_LIBRARY_PATH=/tmp/cirrus-ci-build/build/tmp_install//usr/local/pgsql/lib/x86_64-linux-gnu MALLOC_PERTURB_=95 REGRESS_SHLIB=/tmp/cirrus-ci-build/build/src/test/regress/regress.so PG_REGRESS=/tmp/cirrus-ci-build/build/src/test/regress/pg_regress INITDB_TEMPLATE=/tmp/cirrus-ci-build/build/tmp_install/initdb-template PATH=/tmp/cirrus-ci-build/build/tmp_install//usr/local/pgsql/bin:/tmp/cirrus-ci-build/build/contrib/btree_gin:/usr/local/sbin:/usr/local/bin:/usr/sbin:/usr/bin:/sbin:/bin /usr/bin/python3 /tmp/cirrus-ci-build/build/../src/tools/testwrap --basedir /tmp/cirrus-ci-build/build --srcdir /tmp/cirrus-ci-build/contrib/btree_gin --pg-test-extra '' --testgroup btree_gin --testname regress -- /tmp/cirrus-ci-build/build/src/test/regress/pg_regress --inputdir /tmp/cirrus-ci-build/contrib/btree_gin --expecteddir /tmp/cirrus-ci-build/contrib/btree_gin --bindir '' --dlpath /tmp/cirrus-ci-build/build/contrib/btree_gin --max-concurrent-tests=20 --dbname regression_btree_gin --outputdir /tmp/cirrus-ci-build/build/testrun/btree_gin/regress --temp-instance /tmp/cirrus-ci-build/build/testrun/btree_gin/regress/tmp_check --port 40008 install_btree_gin int2 int4 int8 float4 float8 money oid timestamp timestamptz time timetz date interval macaddr macaddr8 inet cidr text varchar char bytea bit varbit numeric enum uuid name bool bpchar
[11:20:09.282] ――――――――――――――――――――――――――――――――――――― ✀  ―――――――――――――――――――――――――――――――――――――
[11:20:09.282] stderr:
[11:20:09.282] pg_ctl: server does not shut down
[11:20:09.282] # could not stop postmaster: exit code was 256
[11:20:09.282] 
[11:20:09.282] (test program exited with status code 2)
[11:20:09.282] ――――――――――――――――――――――――――――――――――――――――――――――――――――――――――――――――――――――――――――――
[11:20:09.282] 
[11:20:14.977] ▶  62/323 # test failed                                                                 ERROR         
[11:20:14.981]  62/323 postgresql:btree_gist / btree_gist/regress                                      ERROR           121.33s   exit status 2
[11:20:14.981] >>> LD_LIBRARY_PATH=/tmp/cirrus-ci-build/build/tmp_install//usr/local/pgsql/lib/x86_64-linux-gnu PATH=/tmp/cirrus-ci-build/build/tmp_install//usr/local/pgsql/bin:/tmp/cirrus-ci-build/build/contrib/btree_gist:/usr/local/sbin:/usr/local/bin:/usr/sbin:/usr/bin:/sbin:/bin MALLOC_PERTURB_=25 REGRESS_SHLIB=/tmp/cirrus-ci-build/build/src/test/regress/regress.so PG_REGRESS=/tmp/cirrus-ci-build/build/src/test/regress/pg_regress INITDB_TEMPLATE=/tmp/cirrus-ci-build/build/tmp_install/initdb-template /usr/bin/python3 /tmp/cirrus-ci-build/build/../src/tools/testwrap --basedir /tmp/cirrus-ci-build/build --srcdir /tmp/cirrus-ci-build/contrib/btree_gist --pg-test-extra '' --testgroup btree_gist --testname regress -- /tmp/cirrus-ci-build/build/src/test/regress/pg_regress --inputdir /tmp/cirrus-ci-build/contrib/btree_gist --expecteddir /tmp/cirrus-ci-build/contrib/btree_gist --bindir '' --dlpath /tmp/cirrus-ci-build/build/contrib/btree_gist --max-concurrent-tests=20 --dbname regression_btree_gist --outputdir /tmp/cirrus-ci-build/build/testrun/btree_gist/regress --temp-instance /tmp/cirrus-ci-build/build/testrun/btree_gist/regress/tmp_check --port 40009 init int2 int4 int8 float4 float8 cash oid timestamp timestamptz time timetz date interval macaddr macaddr8 inet cidr text varchar char bytea bit varbit numeric uuid not_equal enum bool partitions stratnum without_overlaps
[11:20:14.981] ――――――――――――――――――――――――――――――――――――― ✀  ―――――――――――――――――――――――――――――――――――――
[11:20:14.981] stderr:
[11:20:14.981] pg_ctl: server does not shut down
[11:20:14.981] # could not stop postmaster: exit code was 256
[11:20:14.981] 
[11:20:14.981] (test program exited with status code 2)
[11:20:14.981] ――――――――――――――――――――――――――――――――――――――――――――――――――――――――――――――――――――――――――――――
[11:20:14.981] 
[11:20:26.839] ▶  63/323 # test failed                                                                 ERROR         
[11:20:26.843]  63/323 postgresql:citext / citext/regress                                              ERROR           120.68s   exit status 2
[11:20:26.844] >>> MALLOC_PERTURB_=9 LD_LIBRARY_PATH=/tmp/cirrus-ci-build/build/tmp_install//usr/local/pgsql/lib/x86_64-linux-gnu REGRESS_SHLIB=/tmp/cirrus-ci-build/build/src/test/regress/regress.so PG_REGRESS=/tmp/cirrus-ci-build/build/src/test/regress/pg_regress INITDB_TEMPLATE=/tmp/cirrus-ci-build/build/tmp_install/initdb-template PATH=/tmp/cirrus-ci-build/build/tmp_install//usr/local/pgsql/bin:/tmp/cirrus-ci-build/build/contrib/citext:/usr/local/sbin:/usr/local/bin:/usr/sbin:/usr/bin:/sbin:/bin /usr/bin/python3 /tmp/cirrus-ci-build/build/../src/tools/testwrap --basedir /tmp/cirrus-ci-build/build --srcdir /tmp/cirrus-ci-build/contrib/citext --pg-test-extra '' --testgroup citext --testname regress -- /tmp/cirrus-ci-build/build/src/test/regress/pg_regress --inputdir /tmp/cirrus-ci-build/contrib/citext --expecteddir /tmp/cirrus-ci-build/contrib/citext --bindir '' --dlpath /tmp/cirrus-ci-build/build/contrib/citext --max-concurrent-tests=20 --dbname regression_citext --outputdir /tmp/cirrus-ci-build/build/testrun/citext/regress --temp-instance /tmp/cirrus-ci-build/build/testrun/citext/regress/tmp_check --port 40010 create_index_acl citext citext_utf8
[11:20:26.844] ――――――――――――――――――――――――――――――――――――― ✀  ―――――――――――――――――――――――――――――――――――――
[11:20:26.844] stderr:
[11:20:26.844] pg_ctl: server does not shut down
[11:20:26.844] # could not stop postmaster: exit code was 256
[11:20:26.844] 
[11:20:26.844] (test program exited with status code 2)
[11:20:26.844] ――――――――――――――――――――――――――――――――――――――――――――――――――――――――――――――――――――――――――――――
[11:20:26.844] 
[11:20:35.926] ▶  64/323 # test failed                                                                 ERROR         
[11:20:35.931]  64/323 postgresql:cube / cube/regress                                                  ERROR           120.65s   exit status 2
[11:20:35.931] >>> LD_LIBRARY_PATH=/tmp/cirrus-ci-build/build/tmp_install//usr/local/pgsql/lib/x86_64-linux-gnu MALLOC_PERTURB_=12 PATH=/tmp/cirrus-ci-build/build/tmp_install//usr/local/pgsql/bin:/tmp/cirrus-ci-build/build/contrib/cube:/usr/local/sbin:/usr/local/bin:/usr/sbin:/usr/bin:/sbin:/bin REGRESS_SHLIB=/tmp/cirrus-ci-build/build/src/test/regress/regress.so PG_REGRESS=/tmp/cirrus-ci-build/build/src/test/regress/pg_regress INITDB_TEMPLATE=/tmp/cirrus-ci-build/build/tmp_install/initdb-template /usr/bin/python3 /tmp/cirrus-ci-build/build/../src/tools/testwrap --basedir /tmp/cirrus-ci-build/build --srcdir /tmp/cirrus-ci-build/contrib/cube --pg-test-extra '' --testgroup cube --testname regress -- /tmp/cirrus-ci-build/build/src/test/regress/pg_regress --inputdir /tmp/cirrus-ci-build/contrib/cube --expecteddir /tmp/cirrus-ci-build/contrib/cube --bindir '' --dlpath /tmp/cirrus-ci-build/build/contrib/cube --max-concurrent-tests=20 --dbname regression_cube --outputdir /tmp/cirrus-ci-build/build/testrun/cube/regress --temp-instance /tmp/cirrus-ci-build/build/testrun/cube/regress/tmp_check --port 40011 cube cube_sci
[11:20:35.931] ――――――――――――――――――――――――――――――――――――― ✀  ―――――――――――――――――――――――――――――――――――――
[11:20:35.931] stderr:
[11:20:35.931] pg_ctl: server does not shut down
[11:20:35.931] # could not stop postmaster: exit code was 256
[11:20:35.931] 
[11:20:35.931] (test program exited with status code 2)
[11:20:35.931] ――――――――――――――――――――――――――――――――――――――――――――――――――――――――――――――――――――――――――――――
[11:20:35.931] 
[11:21:51.014] ▶  65/323 # test failed                                                                 ERROR         
[11:21:51.019]  65/323 postgresql:dblink / dblink/regress                                              ERROR           120.67s   exit status 2
[11:21:51.019] >>> PATH=/tmp/cirrus-ci-build/build/tmp_install//usr/local/pgsql/bin:/tmp/cirrus-ci-build/build/contrib/dblink:/usr/local/sbin:/usr/local/bin:/usr/sbin:/usr/bin:/sbin:/bin LD_LIBRARY_PATH=/tmp/cirrus-ci-build/build/tmp_install//usr/local/pgsql/lib/x86_64-linux-gnu MALLOC_PERTURB_=12 REGRESS_SHLIB=/tmp/cirrus-ci-build/build/src/test/regress/regress.so PG_REGRESS=/tmp/cirrus-ci-build/build/src/test/regress/pg_regress INITDB_TEMPLATE=/tmp/cirrus-ci-build/build/tmp_install/initdb-template /usr/bin/python3 /tmp/cirrus-ci-build/build/../src/tools/testwrap --basedir /tmp/cirrus-ci-build/build --srcdir /tmp/cirrus-ci-build/contrib/dblink --pg-test-extra '' --testgroup dblink --testname regress -- /tmp/cirrus-ci-build/build/src/test/regress/pg_regress --inputdir /tmp/cirrus-ci-build/contrib/dblink --expecteddir /tmp/cirrus-ci-build/contrib/dblink --bindir '' --dlpath /tmp/cirrus-ci-build/build/contrib/dblink --max-concurrent-tests=20 --dbname regression_dblink --dlpath /tmp/cirrus-ci-build/build/src/test/regress --outputdir /tmp/cirrus-ci-build/build/testrun/dblink/regress --temp-instance /tmp/cirrus-ci-build/build/testrun/dblink/regress/tmp_check --port 40012 dblink
[11:21:51.019] ――――――――――――――――――――――――――――――――――――― ✀  ―――――――――――――――――――――――――――――――――――――
[11:21:51.019] stderr:
[11:21:51.019] pg_ctl: server does not shut down
[11:21:51.019] # could not stop postmaster: exit code was 256
[11:21:51.019] 
[11:21:51.019] (test program exited with status code 2)
[11:21:51.019] ――――――――――――――――――――――――――――――――――――――――――――――――――――――――――――――――――――――――――――――
[11:21:51.019] 
[11:21:51.627] ▶  66/323 # test failed                                                                 ERROR         
[11:21:51.632]  66/323 postgresql:dict_int / dict_int/regress                                          ERROR           120.46s   exit status 2
[11:21:51.632] >>> MALLOC_PERTURB_=127 PATH=/tmp/cirrus-ci-build/build/tmp_install//usr/local/pgsql/bin:/tmp/cirrus-ci-build/build/contrib/dict_int:/usr/local/sbin:/usr/local/bin:/usr/sbin:/usr/bin:/sbin:/bin LD_LIBRARY_PATH=/tmp/cirrus-ci-build/build/tmp_install//usr/local/pgsql/lib/x86_64-linux-gnu REGRESS_SHLIB=/tmp/cirrus-ci-build/build/src/test/regress/regress.so PG_REGRESS=/tmp/cirrus-ci-build/build/src/test/regress/pg_regress INITDB_TEMPLATE=/tmp/cirrus-ci-build/build/tmp_install/initdb-template /usr/bin/python3 /tmp/cirrus-ci-build/build/../src/tools/testwrap --basedir /tmp/cirrus-ci-build/build --srcdir /tmp/cirrus-ci-build/contrib/dict_int --pg-test-extra '' --testgroup dict_int --testname regress -- /tmp/cirrus-ci-build/build/src/test/regress/pg_regress --inputdir /tmp/cirrus-ci-build/contrib/dict_int --expecteddir /tmp/cirrus-ci-build/contrib/dict_int --bindir '' --dlpath /tmp/cirrus-ci-build/build/contrib/dict_int --max-concurrent-tests=20 --dbname regression_dict_int --outputdir /tmp/cirrus-ci-build/build/testrun/dict_int/regress --temp-instance /tmp/cirrus-ci-build/build/testrun/dict_int/regress/tmp_check --port 40013 dict_int
[11:21:51.632] ――――――――――――――――――――――――――――――――――――― ✀  ―――――――――――――――――――――――――――――――――――――
[11:21:51.632] stderr:
[11:21:51.632] pg_ctl: server does not shut down
[11:21:51.632] # could not stop postmaster: exit code was 256
[11:21:51.632] 
[11:21:51.632] (test program exited with status code 2)
[11:21:51.632] ――――――――――――――――――――――――――――――――――――――――――――――――――――――――――――――――――――――――――――――
[11:21:51.632] 
[11:21:55.820] ▶  67/323 # test failed                                                                 ERROR         
[11:21:55.826]  67/323 postgresql:dict_xsyn / dict_xsyn/regress                                        ERROR           120.45s   exit status 2
[11:21:55.826] >>> PATH=/tmp/cirrus-ci-build/build/tmp_install//usr/local/pgsql/bin:/tmp/cirrus-ci-build/build/contrib/dict_xsyn:/usr/local/sbin:/usr/local/bin:/usr/sbin:/usr/bin:/sbin:/bin LD_LIBRARY_PATH=/tmp/cirrus-ci-build/build/tmp_install//usr/local/pgsql/lib/x86_64-linux-gnu MALLOC_PERTURB_=121 REGRESS_SHLIB=/tmp/cirrus-ci-build/build/src/test/regress/regress.so PG_REGRESS=/tmp/cirrus-ci-build/build/src/test/regress/pg_regress INITDB_TEMPLATE=/tmp/cirrus-ci-build/build/tmp_install/initdb-template /usr/bin/python3 /tmp/cirrus-ci-build/build/../src/tools/testwrap --basedir /tmp/cirrus-ci-build/build --srcdir /tmp/cirrus-ci-build/contrib/dict_xsyn --pg-test-extra '' --testgroup dict_xsyn --testname regress -- /tmp/cirrus-ci-build/build/src/test/regress/pg_regress --inputdir /tmp/cirrus-ci-build/contrib/dict_xsyn --expecteddir /tmp/cirrus-ci-build/contrib/dict_xsyn --bindir '' --dlpath /tmp/cirrus-ci-build/build/contrib/dict_xsyn --max-concurrent-tests=20 --dbname regression_dict_xsyn --outputdir /tmp/cirrus-ci-build/build/testrun/dict_xsyn/regress --temp-instance /tmp/cirrus-ci-build/build/testrun/dict_xsyn/regress/tmp_check --port 40014 dict_xsyn
[11:21:55.826] ――――――――――――――――――――――――――――――――――――― ✀  ―――――――――――――――――――――――――――――――――――――
[11:21:55.826] stderr:
[11:21:55.826] pg_ctl: server does not shut down
[11:21:55.826] # could not stop postmaster: exit code was 256
[11:21:55.826] 
[11:21:55.826] (test program exited with status code 2)
[11:21:55.826] ――――――――――――――――――――――――――――――――――――――――――――――――――――――――――――――――――――――――――――――
[11:21:55.826] 
[11:21:59.759] ▶  68/323 # test failed                                                                 ERROR         
[11:21:59.764]  68/323 postgresql:earthdistance / earthdistance/regress                                ERROR           120.65s   exit status 2
[11:21:59.764] >>> LD_LIBRARY_PATH=/tmp/cirrus-ci-build/build/tmp_install//usr/local/pgsql/lib/x86_64-linux-gnu PATH=/tmp/cirrus-ci-build/build/tmp_install//usr/local/pgsql/bin:/tmp/cirrus-ci-build/build/contrib/earthdistance:/usr/local/sbin:/usr/local/bin:/usr/sbin:/usr/bin:/sbin:/bin REGRESS_SHLIB=/tmp/cirrus-ci-build/build/src/test/regress/regress.so PG_REGRESS=/tmp/cirrus-ci-build/build/src/test/regress/pg_regress MALLOC_PERTURB_=112 INITDB_TEMPLATE=/tmp/cirrus-ci-build/build/tmp_install/initdb-template /usr/bin/python3 /tmp/cirrus-ci-build/build/../src/tools/testwrap --basedir /tmp/cirrus-ci-build/build --srcdir /tmp/cirrus-ci-build/contrib/earthdistance --pg-test-extra '' --testgroup earthdistance --testname regress -- /tmp/cirrus-ci-build/build/src/test/regress/pg_regress --inputdir /tmp/cirrus-ci-build/contrib/earthdistance --expecteddir /tmp/cirrus-ci-build/contrib/earthdistance --bindir '' --dlpath /tmp/cirrus-ci-build/build/contrib/earthdistance --max-concurrent-tests=20 --dbname regression_earthdistance --outputdir /tmp/cirrus-ci-build/build/testrun/earthdistance/regress --temp-instance /tmp/cirrus-ci-build/build/testrun/earthdistance/regress/tmp_check --port 40015 earthdistance
[11:21:59.764] ――――――――――――――――――――――――――――――――――――― ✀  ―――――――――――――――――――――――――――――――――――――
[11:21:59.764] stderr:
[11:21:59.764] pg_ctl: server does not shut down
[11:21:59.764] # could not stop postmaster: exit code was 256
[11:21:59.764] 
[11:21:59.764] (test program exited with status code 2)
[11:21:59.764] ――――――――――――――――――――――――――――――――――――――――――――――――――――――――――――――――――――――――――――――
[11:21:59.764] 
[11:22:09.760] ▶  69/323 # test failed                                                                 ERROR         
[11:22:09.765]  69/323 postgresql:file_fdw / file_fdw/regress                                          ERROR           120.48s   exit status 2
[11:22:09.765] >>> LD_LIBRARY_PATH=/tmp/cirrus-ci-build/build/tmp_install//usr/local/pgsql/lib/x86_64-linux-gnu MALLOC_PERTURB_=199 REGRESS_SHLIB=/tmp/cirrus-ci-build/build/src/test/regress/regress.so PG_REGRESS=/tmp/cirrus-ci-build/build/src/test/regress/pg_regress PATH=/tmp/cirrus-ci-build/build/tmp_install//usr/local/pgsql/bin:/tmp/cirrus-ci-build/build/contrib/file_fdw:/usr/local/sbin:/usr/local/bin:/usr/sbin:/usr/bin:/sbin:/bin INITDB_TEMPLATE=/tmp/cirrus-ci-build/build/tmp_install/initdb-template /usr/bin/python3 /tmp/cirrus-ci-build/build/../src/tools/testwrap --basedir /tmp/cirrus-ci-build/build --srcdir /tmp/cirrus-ci-build/contrib/file_fdw --pg-test-extra '' --testgroup file_fdw --testname regress -- /tmp/cirrus-ci-build/build/src/test/regress/pg_regress --inputdir /tmp/cirrus-ci-build/contrib/file_fdw --expecteddir /tmp/cirrus-ci-build/contrib/file_fdw --bindir '' --dlpath /tmp/cirrus-ci-build/build/contrib/file_fdw --max-concurrent-tests=20 --dbname regression_file_fdw --outputdir /tmp/cirrus-ci-build/build/testrun/file_fdw/regress --temp-instance /tmp/cirrus-ci-build/build/testrun/file_fdw/regress/tmp_check --port 40016 file_fdw
[11:22:09.765] ――――――――――――――――――――――――――――――――――――― ✀  ―――――――――――――――――――――――――――――――――――――
[11:22:09.765] stderr:
[11:22:09.765] pg_ctl: server does not shut down
[11:22:09.765] # could not stop postmaster: exit code was 256
[11:22:09.765] 
[11:22:09.765] (test program exited with status code 2)
[11:22:09.765] ――――――――――――――――――――――――――――――――――――――――――――――――――――――――――――――――――――――――――――――
[11:22:09.765] 
[11:22:15.441] ▶  70/323 # test failed                                                                 ERROR         
[11:22:15.446]  70/323 postgresql:fuzzystrmatch / fuzzystrmatch/regress                                ERROR           120.46s   exit status 2
[11:22:15.446] >>> PATH=/tmp/cirrus-ci-build/build/tmp_install//usr/local/pgsql/bin:/tmp/cirrus-ci-build/build/contrib/fuzzystrmatch:/usr/local/sbin:/usr/local/bin:/usr/sbin:/usr/bin:/sbin:/bin LD_LIBRARY_PATH=/tmp/cirrus-ci-build/build/tmp_install//usr/local/pgsql/lib/x86_64-linux-gnu MALLOC_PERTURB_=211 REGRESS_SHLIB=/tmp/cirrus-ci-build/build/src/test/regress/regress.so PG_REGRESS=/tmp/cirrus-ci-build/build/src/test/regress/pg_regress INITDB_TEMPLATE=/tmp/cirrus-ci-build/build/tmp_install/initdb-template /usr/bin/python3 /tmp/cirrus-ci-build/build/../src/tools/testwrap --basedir /tmp/cirrus-ci-build/build --srcdir /tmp/cirrus-ci-build/contrib/fuzzystrmatch --pg-test-extra '' --testgroup fuzzystrmatch --testname regress -- /tmp/cirrus-ci-build/build/src/test/regress/pg_regress --inputdir /tmp/cirrus-ci-build/contrib/fuzzystrmatch --expecteddir /tmp/cirrus-ci-build/contrib/fuzzystrmatch --bindir '' --dlpath /tmp/cirrus-ci-build/build/contrib/fuzzystrmatch --max-concurrent-tests=20 --dbname regression_fuzzystrmatch --outputdir /tmp/cirrus-ci-build/build/testrun/fuzzystrmatch/regress --temp-instance /tmp/cirrus-ci-build/build/testrun/fuzzystrmatch/regress/tmp_check --port 40017 fuzzystrmatch fuzzystrmatch_utf8
[11:22:15.446] ――――――――――――――――――――――――――――――――――――― ✀  ―――――――――――――――――――――――――――――――――――――
[11:22:15.446] stderr:
[11:22:15.446] pg_ctl: server does not shut down
[11:22:15.446] # could not stop postmaster: exit code was 256
[11:22:15.446] 
[11:22:15.446] (test program exited with status code 2)
[11:22:15.446] ――――――――――――――――――――――――――――――――――――――――――――――――――――――――――――――――――――――――――――――
[11:22:15.446] 
[11:22:28.389] ▶  71/323 # test failed                                                                 ERROR         
[11:22:28.394]  71/323 postgresql:hstore / hstore/regress                                              ERROR           121.55s   exit status 2
[11:22:28.394] >>> LD_LIBRARY_PATH=/tmp/cirrus-ci-build/build/tmp_install//usr/local/pgsql/lib/x86_64-linux-gnu MALLOC_PERTURB_=245 PATH=/tmp/cirrus-ci-build/build/tmp_install//usr/local/pgsql/bin:/tmp/cirrus-ci-build/build/contrib/hstore:/usr/local/sbin:/usr/local/bin:/usr/sbin:/usr/bin:/sbin:/bin REGRESS_SHLIB=/tmp/cirrus-ci-build/build/src/test/regress/regress.so PG_REGRESS=/tmp/cirrus-ci-build/build/src/test/regress/pg_regress INITDB_TEMPLATE=/tmp/cirrus-ci-build/build/tmp_install/initdb-template /usr/bin/python3 /tmp/cirrus-ci-build/build/../src/tools/testwrap --basedir /tmp/cirrus-ci-build/build --srcdir /tmp/cirrus-ci-build/contrib/hstore --pg-test-extra '' --testgroup hstore --testname regress -- /tmp/cirrus-ci-build/build/src/test/regress/pg_regress --inputdir /tmp/cirrus-ci-build/contrib/hstore --expecteddir /tmp/cirrus-ci-build/contrib/hstore --bindir '' --dlpath /tmp/cirrus-ci-build/build/contrib/hstore --max-concurrent-tests=20 --dbname regression_hstore --outputdir /tmp/cirrus-ci-build/build/testrun/hstore/regress --temp-instance /tmp/cirrus-ci-build/build/testrun/hstore/regress/tmp_check --port 40018 hstore hstore_utf8
[11:22:28.394] ――――――――――――――――――――――――――――――――――――― ✀  ―――――――――――――――――――――――――――――――――――――
[11:22:28.394] stderr:
[11:22:28.394] pg_ctl: server does not shut down
[11:22:28.394] # could not stop postmaster: exit code was 256
[11:22:28.394] 
[11:22:28.394] (test program exited with status code 2)
[11:22:28.394] ――――――――――――――――――――――――――――――――――――――――――――――――――――――――――――――――――――――――――――――
[11:22:28.394] 
[11:22:36.578] ▶  72/323 # test failed                                                                 ERROR         
[11:22:36.583]  72/323 postgresql:hstore_plperl / hstore_plperl/regress                                ERROR           120.65s   exit status 2
[11:22:36.583] >>> LD_LIBRARY_PATH=/tmp/cirrus-ci-build/build/tmp_install//usr/local/pgsql/lib/x86_64-linux-gnu MALLOC_PERTURB_=104 PATH=/tmp/cirrus-ci-build/build/tmp_install//usr/local/pgsql/bin:/tmp/cirrus-ci-build/build/contrib/hstore_plperl:/usr/local/sbin:/usr/local/bin:/usr/sbin:/usr/bin:/sbin:/bin REGRESS_SHLIB=/tmp/cirrus-ci-build/build/src/test/regress/regress.so PG_REGRESS=/tmp/cirrus-ci-build/build/src/test/regress/pg_regress INITDB_TEMPLATE=/tmp/cirrus-ci-build/build/tmp_install/initdb-template /usr/bin/python3 /tmp/cirrus-ci-build/build/../src/tools/testwrap --basedir /tmp/cirrus-ci-build/build --srcdir /tmp/cirrus-ci-build/contrib/hstore_plperl --pg-test-extra '' --testgroup hstore_plperl --testname regress -- /tmp/cirrus-ci-build/build/src/test/regress/pg_regress --inputdir /tmp/cirrus-ci-build/contrib/hstore_plperl --expecteddir /tmp/cirrus-ci-build/contrib/hstore_plperl --bindir '' --dlpath /tmp/cirrus-ci-build/build/contrib/hstore_plperl --max-concurrent-tests=20 --dbname regression_hstore_plperl --outputdir /tmp/cirrus-ci-build/build/testrun/hstore_plperl/regress --temp-instance /tmp/cirrus-ci-build/build/testrun/hstore_plperl/regress/tmp_check --port 40019 hstore_plperl hstore_plperlu create_transform
[11:22:36.583] ――――――――――――――――――――――――――――――――――――― ✀  ―――――――――――――――――――――――――――――――――――――
[11:22:36.583] stderr:
[11:22:36.583] pg_ctl: server does not shut down
[11:22:36.583] # could not stop postmaster: exit code was 256
[11:22:36.583] 
[11:22:36.583] (test program exited with status code 2)
[11:22:36.583] ――――――――――――――――――――――――――――――――――――――――――――――――――――――――――――――――――――――――――――――
[11:22:36.583] 
[11:23:51.500] ▶  73/323 # test failed                                                                 ERROR         
[11:23:51.505]  73/323 postgresql:hstore_plpython / hstore_plpython/regress                            ERROR           120.49s   exit status 2
[11:23:51.505] >>> LD_LIBRARY_PATH=/tmp/cirrus-ci-build/build/tmp_install//usr/local/pgsql/lib/x86_64-linux-gnu PATH=/tmp/cirrus-ci-build/build/tmp_install//usr/local/pgsql/bin:/tmp/cirrus-ci-build/build/contrib/hstore_plpython:/usr/local/sbin:/usr/local/bin:/usr/sbin:/usr/bin:/sbin:/bin MALLOC_PERTURB_=218 REGRESS_SHLIB=/tmp/cirrus-ci-build/build/src/test/regress/regress.so PG_REGRESS=/tmp/cirrus-ci-build/build/src/test/regress/pg_regress INITDB_TEMPLATE=/tmp/cirrus-ci-build/build/tmp_install/initdb-template /usr/bin/python3 /tmp/cirrus-ci-build/build/../src/tools/testwrap --basedir /tmp/cirrus-ci-build/build --srcdir /tmp/cirrus-ci-build/contrib/hstore_plpython --pg-test-extra '' --testgroup hstore_plpython --testname regress -- /tmp/cirrus-ci-build/build/src/test/regress/pg_regress --inputdir /tmp/cirrus-ci-build/contrib/hstore_plpython --expecteddir /tmp/cirrus-ci-build/contrib/hstore_plpython --bindir '' --dlpath /tmp/cirrus-ci-build/build/contrib/hstore_plpython --max-concurrent-tests=20 --dbname regression_hstore_plpython --load-extension=hstore --outputdir /tmp/cirrus-ci-build/build/testrun/hstore_plpython/regress --temp-instance /tmp/cirrus-ci-build/build/testrun/hstore_plpython/regress/tmp_check --port 40020 hstore_plpython
[11:23:51.505] ――――――――――――――――――――――――――――――――――――― ✀  ―――――――――――――――――――――――――――――――――――――
[11:23:51.505] stderr:
[11:23:51.505] pg_ctl: server does not shut down
[11:23:51.505] # could not stop postmaster: exit code was 256
[11:23:51.505] 
[11:23:51.505] (test program exited with status code 2)
[11:23:51.505] ――――――――――――――――――――――――――――――――――――――――――――――――――――――――――――――――――――――――――――――
[11:23:51.505] 
[11:23:56.405] ▶  74/323 # test failed                                                                 ERROR         
[11:23:56.410]  74/323 postgresql:isn / isn/regress                                                    ERROR           120.58s   exit status 2
[11:23:56.410] >>> LD_LIBRARY_PATH=/tmp/cirrus-ci-build/build/tmp_install//usr/local/pgsql/lib/x86_64-linux-gnu MALLOC_PERTURB_=72 PATH=/tmp/cirrus-ci-build/build/tmp_install//usr/local/pgsql/bin:/tmp/cirrus-ci-build/build/contrib/isn:/usr/local/sbin:/usr/local/bin:/usr/sbin:/usr/bin:/sbin:/bin REGRESS_SHLIB=/tmp/cirrus-ci-build/build/src/test/regress/regress.so PG_REGRESS=/tmp/cirrus-ci-build/build/src/test/regress/pg_regress INITDB_TEMPLATE=/tmp/cirrus-ci-build/build/tmp_install/initdb-template /usr/bin/python3 /tmp/cirrus-ci-build/build/../src/tools/testwrap --basedir /tmp/cirrus-ci-build/build --srcdir /tmp/cirrus-ci-build/contrib/isn --pg-test-extra '' --testgroup isn --testname regress -- /tmp/cirrus-ci-build/build/src/test/regress/pg_regress --inputdir /tmp/cirrus-ci-build/contrib/isn --expecteddir /tmp/cirrus-ci-build/contrib/isn --bindir '' --dlpath /tmp/cirrus-ci-build/build/contrib/isn --max-concurrent-tests=20 --dbname regression_isn --outputdir /tmp/cirrus-ci-build/build/testrun/isn/regress --temp-instance /tmp/cirrus-ci-build/build/testrun/isn/regress/tmp_check --port 40022 isn
[11:23:56.410] ――――――――――――――――――――――――――――――――――――― ✀  ―――――――――――――――――――――――――――――――――――――
[11:23:56.410] stderr:
[11:23:56.410] pg_ctl: server does not shut down
[11:23:56.410] # could not stop postmaster: exit code was 256
[11:23:56.410] 
[11:23:56.410] (test program exited with status code 2)
[11:23:56.410] ――――――――――――――――――――――――――――――――――――――――――――――――――――――――――――――――――――――――――――――
[11:23:56.410] 
[11:23:57.088] ▶  75/323 # test failed                                                                 ERROR         
[11:23:57.093]  75/323 postgresql:intarray / intarray/regress                                          ERROR           125.46s   exit status 2
[11:23:57.093] >>> PATH=/tmp/cirrus-ci-build/build/tmp_install//usr/local/pgsql/bin:/tmp/cirrus-ci-build/build/contrib/intarray:/usr/local/sbin:/usr/local/bin:/usr/sbin:/usr/bin:/sbin:/bin LD_LIBRARY_PATH=/tmp/cirrus-ci-build/build/tmp_install//usr/local/pgsql/lib/x86_64-linux-gnu MALLOC_PERTURB_=230 REGRESS_SHLIB=/tmp/cirrus-ci-build/build/src/test/regress/regress.so PG_REGRESS=/tmp/cirrus-ci-build/build/src/test/regress/pg_regress INITDB_TEMPLATE=/tmp/cirrus-ci-build/build/tmp_install/initdb-template /usr/bin/python3 /tmp/cirrus-ci-build/build/../src/tools/testwrap --basedir /tmp/cirrus-ci-build/build --srcdir /tmp/cirrus-ci-build/contrib/intarray --pg-test-extra '' --testgroup intarray --testname regress -- /tmp/cirrus-ci-build/build/src/test/regress/pg_regress --inputdir /tmp/cirrus-ci-build/contrib/intarray --expecteddir /tmp/cirrus-ci-build/contrib/intarray --bindir '' --dlpath /tmp/cirrus-ci-build/build/contrib/intarray --max-concurrent-tests=20 --dbname regression_intarray --outputdir /tmp/cirrus-ci-build/build/testrun/intarray/regress --temp-instance /tmp/cirrus-ci-build/build/testrun/intarray/regress/tmp_check --port 40021 _int
[11:23:57.093] ――――――――――――――――――――――――――――――――――――― ✀  ―――――――――――――――――――――――――――――――――――――
[11:23:57.093] stderr:
[11:23:57.093] pg_ctl: server does not shut down
[11:23:57.093] # could not stop postmaster: exit code was 256
[11:23:57.093] 
[11:23:57.093] (test program exited with status code 2)
[11:23:57.093] ――――――――――――――――――――――――――――――――――――――――――――――――――――――――――――――――――――――――――――――
[11:23:57.093] 
[11:24:00.270] ▶  76/323 # test failed                                                                 ERROR         
[11:24:00.275]  76/323 postgresql:jsonb_plperl / jsonb_plperl/regress                                  ERROR           120.51s   exit status 2
[11:24:00.275] >>> LD_LIBRARY_PATH=/tmp/cirrus-ci-build/build/tmp_install//usr/local/pgsql/lib/x86_64-linux-gnu MALLOC_PERTURB_=92 PATH=/tmp/cirrus-ci-build/build/tmp_install//usr/local/pgsql/bin:/tmp/cirrus-ci-build/build/contrib/jsonb_plperl:/usr/local/sbin:/usr/local/bin:/usr/sbin:/usr/bin:/sbin:/bin REGRESS_SHLIB=/tmp/cirrus-ci-build/build/src/test/regress/regress.so PG_REGRESS=/tmp/cirrus-ci-build/build/src/test/regress/pg_regress INITDB_TEMPLATE=/tmp/cirrus-ci-build/build/tmp_install/initdb-template /usr/bin/python3 /tmp/cirrus-ci-build/build/../src/tools/testwrap --basedir /tmp/cirrus-ci-build/build --srcdir /tmp/cirrus-ci-build/contrib/jsonb_plperl --pg-test-extra '' --testgroup jsonb_plperl --testname regress -- /tmp/cirrus-ci-build/build/src/test/regress/pg_regress --inputdir /tmp/cirrus-ci-build/contrib/jsonb_plperl --expecteddir /tmp/cirrus-ci-build/contrib/jsonb_plperl --bindir '' --dlpath /tmp/cirrus-ci-build/build/contrib/jsonb_plperl --max-concurrent-tests=20 --dbname regression_jsonb_plperl --outputdir /tmp/cirrus-ci-build/build/testrun/jsonb_plperl/regress --temp-instance /tmp/cirrus-ci-build/build/testrun/jsonb_plperl/regress/tmp_check --port 40023 jsonb_plperl jsonb_plperlu
[11:24:00.275] ――――――――――――――――――――――――――――――――――――― ✀  ―――――――――――――――――――――――――――――――――――――
[11:24:00.275] stderr:
[11:24:00.275] pg_ctl: server does not shut down
[11:24:00.275] # could not stop postmaster: exit code was 256
[11:24:00.275] 
[11:24:00.275] (test program exited with status code 2)
[11:24:00.275] ――――――――――――――――――――――――――――――――――――――――――――――――――――――――――――――――――――――――――――――
[11:24:00.275] 
[11:24:10.224] ▶  77/323 # test failed                                                                 ERROR         
[11:24:10.229]  77/323 postgresql:jsonb_plpython / jsonb_plpython/regress                              ERROR           120.46s   exit status 2
[11:24:10.229] >>> LD_LIBRARY_PATH=/tmp/cirrus-ci-build/build/tmp_install//usr/local/pgsql/lib/x86_64-linux-gnu PATH=/tmp/cirrus-ci-build/build/tmp_install//usr/local/pgsql/bin:/tmp/cirrus-ci-build/build/contrib/jsonb_plpython:/usr/local/sbin:/usr/local/bin:/usr/sbin:/usr/bin:/sbin:/bin REGRESS_SHLIB=/tmp/cirrus-ci-build/build/src/test/regress/regress.so PG_REGRESS=/tmp/cirrus-ci-build/build/src/test/regress/pg_regress INITDB_TEMPLATE=/tmp/cirrus-ci-build/build/tmp_install/initdb-template MALLOC_PERTURB_=198 /usr/bin/python3 /tmp/cirrus-ci-build/build/../src/tools/testwrap --basedir /tmp/cirrus-ci-build/build --srcdir /tmp/cirrus-ci-build/contrib/jsonb_plpython --pg-test-extra '' --testgroup jsonb_plpython --testname regress -- /tmp/cirrus-ci-build/build/src/test/regress/pg_regress --inputdir /tmp/cirrus-ci-build/contrib/jsonb_plpython --expecteddir /tmp/cirrus-ci-build/contrib/jsonb_plpython --bindir '' --dlpath /tmp/cirrus-ci-build/build/contrib/jsonb_plpython --max-concurrent-tests=20 --dbname regression_jsonb_plpython --outputdir /tmp/cirrus-ci-build/build/testrun/jsonb_plpython/regress --temp-instance /tmp/cirrus-ci-build/build/testrun/jsonb_plpython/regress/tmp_check --port 40024 jsonb_plpython
[11:24:10.229] ――――――――――――――――――――――――――――――――――――― ✀  ―――――――――――――――――――――――――――――――――――――
[11:24:10.229] stderr:
[11:24:10.229] pg_ctl: server does not shut down
[11:24:10.229] # could not stop postmaster: exit code was 256
[11:24:10.229] 
[11:24:10.229] (test program exited with status code 2)
[11:24:10.229] ――――――――――――――――――――――――――――――――――――――――――――――――――――――――――――――――――――――――――――――
[11:24:10.229] 
[11:24:15.898] ▶  78/323 # test failed                                                                 ERROR         
[11:24:15.903]  78/323 postgresql:lo / lo/regress                                                      ERROR           120.46s   exit status 2
[11:24:15.904] >>> LD_LIBRARY_PATH=/tmp/cirrus-ci-build/build/tmp_install//usr/local/pgsql/lib/x86_64-linux-gnu MALLOC_PERTURB_=219 REGRESS_SHLIB=/tmp/cirrus-ci-build/build/src/test/regress/regress.so PG_REGRESS=/tmp/cirrus-ci-build/build/src/test/regress/pg_regress INITDB_TEMPLATE=/tmp/cirrus-ci-build/build/tmp_install/initdb-template PATH=/tmp/cirrus-ci-build/build/tmp_install//usr/local/pgsql/bin:/tmp/cirrus-ci-build/build/contrib/lo:/usr/local/sbin:/usr/local/bin:/usr/sbin:/usr/bin:/sbin:/bin /usr/bin/python3 /tmp/cirrus-ci-build/build/../src/tools/testwrap --basedir /tmp/cirrus-ci-build/build --srcdir /tmp/cirrus-ci-build/contrib/lo --pg-test-extra '' --testgroup lo --testname regress -- /tmp/cirrus-ci-build/build/src/test/regress/pg_regress --inputdir /tmp/cirrus-ci-build/contrib/lo --expecteddir /tmp/cirrus-ci-build/contrib/lo --bindir '' --dlpath /tmp/cirrus-ci-build/build/contrib/lo --max-concurrent-tests=20 --dbname regression_lo --outputdir /tmp/cirrus-ci-build/build/testrun/lo/regress --temp-instance /tmp/cirrus-ci-build/build/testrun/lo/regress/tmp_check --port 40025 lo
[11:24:15.904] ――――――――――――――――――――――――――――――――――――― ✀  ―――――――――――――――――――――――――――――――――――――
[11:24:15.904] stderr:
[11:24:15.904] pg_ctl: server does not shut down
[11:24:15.904] # could not stop postmaster: exit code was 256
[11:24:15.904] 
[11:24:15.904] (test program exited with status code 2)
[11:24:15.904] ――――――――――――――――――――――――――――――――――――――――――――――――――――――――――――――――――――――――――――――
[11:24:15.904] 
[11:24:29.274] ▶  79/323 # test failed                                                                 ERROR         
[11:24:29.280]  79/323 postgresql:ltree / ltree/regress                                                ERROR           120.89s   exit status 2
[11:24:29.280] >>> MALLOC_PERTURB_=4 LD_LIBRARY_PATH=/tmp/cirrus-ci-build/build/tmp_install//usr/local/pgsql/lib/x86_64-linux-gnu REGRESS_SHLIB=/tmp/cirrus-ci-build/build/src/test/regress/regress.so PG_REGRESS=/tmp/cirrus-ci-build/build/src/test/regress/pg_regress INITDB_TEMPLATE=/tmp/cirrus-ci-build/build/tmp_install/initdb-template PATH=/tmp/cirrus-ci-build/build/tmp_install//usr/local/pgsql/bin:/tmp/cirrus-ci-build/build/contrib/ltree:/usr/local/sbin:/usr/local/bin:/usr/sbin:/usr/bin:/sbin:/bin /usr/bin/python3 /tmp/cirrus-ci-build/build/../src/tools/testwrap --basedir /tmp/cirrus-ci-build/build --srcdir /tmp/cirrus-ci-build/contrib/ltree --pg-test-extra '' --testgroup ltree --testname regress -- /tmp/cirrus-ci-build/build/src/test/regress/pg_regress --inputdir /tmp/cirrus-ci-build/contrib/ltree --expecteddir /tmp/cirrus-ci-build/contrib/ltree --bindir '' --dlpath /tmp/cirrus-ci-build/build/contrib/ltree --max-concurrent-tests=20 --dbname regression_ltree --outputdir /tmp/cirrus-ci-build/build/testrun/ltree/regress --temp-instance /tmp/cirrus-ci-build/build/testrun/ltree/regress/tmp_check --port 40026 ltree
[11:24:29.280] ――――――――――――――――――――――――――――――――――――― ✀  ―――――――――――――――――――――――――――――――――――――
[11:24:29.280] stderr:
[11:24:29.280] pg_ctl: server does not shut down
[11:24:29.280] # could not stop postmaster: exit code was 256
[11:24:29.280] 
[11:24:29.280] (test program exited with status code 2)
[11:24:29.280] ――――――――――――――――――――――――――――――――――――――――――――――――――――――――――――――――――――――――――――――
[11:24:29.280] 
[11:24:37.067] ▶  80/323 # test failed                                                                 ERROR         
[11:24:37.072]  80/323 postgresql:ltree_plpython / ltree_plpython/regress                              ERROR           120.49s   exit status 2
[11:24:37.072] >>> LD_LIBRARY_PATH=/tmp/cirrus-ci-build/build/tmp_install//usr/local/pgsql/lib/x86_64-linux-gnu MALLOC_PERTURB_=237 PATH=/tmp/cirrus-ci-build/build/tmp_install//usr/local/pgsql/bin:/tmp/cirrus-ci-build/build/contrib/ltree_plpython:/usr/local/sbin:/usr/local/bin:/usr/sbin:/usr/bin:/sbin:/bin REGRESS_SHLIB=/tmp/cirrus-ci-build/build/src/test/regress/regress.so PG_REGRESS=/tmp/cirrus-ci-build/build/src/test/regress/pg_regress INITDB_TEMPLATE=/tmp/cirrus-ci-build/build/tmp_install/initdb-template /usr/bin/python3 /tmp/cirrus-ci-build/build/../src/tools/testwrap --basedir /tmp/cirrus-ci-build/build --srcdir /tmp/cirrus-ci-build/contrib/ltree_plpython --pg-test-extra '' --testgroup ltree_plpython --testname regress -- /tmp/cirrus-ci-build/build/src/test/regress/pg_regress --inputdir /tmp/cirrus-ci-build/contrib/ltree_plpython --expecteddir /tmp/cirrus-ci-build/contrib/ltree_plpython --bindir '' --dlpath /tmp/cirrus-ci-build/build/contrib/ltree_plpython --max-concurrent-tests=20 --dbname regression_ltree_plpython --load-extension=ltree --outputdir /tmp/cirrus-ci-build/build/testrun/ltree_plpython/regress --temp-instance /tmp/cirrus-ci-build/build/testrun/ltree_plpython/regress/tmp_check --port 40027 ltree_plpython
[11:24:37.072] ――――――――――――――――――――――――――――――――――――― ✀  ―――――――――――――――――――――――――――――――――――――
[11:24:37.072] stderr:
[11:24:37.072] pg_ctl: server does not shut down
[11:24:37.072] # could not stop postmaster: exit code was 256
[11:24:37.072] 
[11:24:37.072] (test program exited with status code 2)
[11:24:37.072] ――――――――――――――――――――――――――――――――――――――――――――――――――――――――――――――――――――――――――――――
[11:24:37.072] 
[11:25:52.548] ▶  81/323 # test failed                                                                 ERROR         
[11:25:52.553]  81/323 postgresql:pageinspect / pageinspect/regress                                    ERROR           121.05s   exit status 2
[11:25:52.553] >>> LD_LIBRARY_PATH=/tmp/cirrus-ci-build/build/tmp_install//usr/local/pgsql/lib/x86_64-linux-gnu PG_REGRESS=/tmp/cirrus-ci-build/build/src/test/regress/pg_regress REGRESS_SHLIB=/tmp/cirrus-ci-build/build/src/test/regress/regress.so MALLOC_PERTURB_=49 PATH=/tmp/cirrus-ci-build/build/tmp_install//usr/local/pgsql/bin:/tmp/cirrus-ci-build/build/contrib/pageinspect:/usr/local/sbin:/usr/local/bin:/usr/sbin:/usr/bin:/sbin:/bin INITDB_TEMPLATE=/tmp/cirrus-ci-build/build/tmp_install/initdb-template /usr/bin/python3 /tmp/cirrus-ci-build/build/../src/tools/testwrap --basedir /tmp/cirrus-ci-build/build --srcdir /tmp/cirrus-ci-build/contrib/pageinspect --pg-test-extra '' --testgroup pageinspect --testname regress -- /tmp/cirrus-ci-build/build/src/test/regress/pg_regress --inputdir /tmp/cirrus-ci-build/contrib/pageinspect --expecteddir /tmp/cirrus-ci-build/contrib/pageinspect --bindir '' --dlpath /tmp/cirrus-ci-build/build/contrib/pageinspect --max-concurrent-tests=20 --dbname regression_pageinspect --outputdir /tmp/cirrus-ci-build/build/testrun/pageinspect/regress --temp-instance /tmp/cirrus-ci-build/build/testrun/pageinspect/regress/tmp_check --port 40028 page btree brin gin gist hash checksum oldextversions
[11:25:52.553] ――――――――――――――――――――――――――――――――――――― ✀  ―――――――――――――――――――――――――――――――――――――
[11:25:52.553] stderr:
[11:25:52.553] pg_ctl: server does not shut down
[11:25:52.553] # could not stop postmaster: exit code was 256
[11:25:52.553] 
[11:25:52.553] (test program exited with status code 2)
[11:25:52.553] ――――――――――――――――――――――――――――――――――――――――――――――――――――――――――――――――――――――――――――――
[11:25:52.553] 
[11:25:56.860] ▶  82/323 # test failed                                                                 ERROR         
[11:25:56.865]  82/323 postgresql:passwordcheck / passwordcheck/regress                                ERROR           120.45s   exit status 2
[11:25:56.865] >>> LD_LIBRARY_PATH=/tmp/cirrus-ci-build/build/tmp_install//usr/local/pgsql/lib/x86_64-linux-gnu MALLOC_PERTURB_=227 PATH=/tmp/cirrus-ci-build/build/tmp_install//usr/local/pgsql/bin:/tmp/cirrus-ci-build/build/contrib/passwordcheck:/usr/local/sbin:/usr/local/bin:/usr/sbin:/usr/bin:/sbin:/bin REGRESS_SHLIB=/tmp/cirrus-ci-build/build/src/test/regress/regress.so PG_REGRESS=/tmp/cirrus-ci-build/build/src/test/regress/pg_regress INITDB_TEMPLATE=/tmp/cirrus-ci-build/build/tmp_install/initdb-template /usr/bin/python3 /tmp/cirrus-ci-build/build/../src/tools/testwrap --basedir /tmp/cirrus-ci-build/build --srcdir /tmp/cirrus-ci-build/contrib/passwordcheck --pg-test-extra '' --testgroup passwordcheck --testname regress -- /tmp/cirrus-ci-build/build/src/test/regress/pg_regress --inputdir /tmp/cirrus-ci-build/contrib/passwordcheck --expecteddir /tmp/cirrus-ci-build/contrib/passwordcheck --bindir '' --dlpath /tmp/cirrus-ci-build/build/contrib/passwordcheck --max-concurrent-tests=20 --dbname regression_passwordcheck --outputdir /tmp/cirrus-ci-build/build/testrun/passwordcheck/regress --temp-instance /tmp/cirrus-ci-build/build/testrun/passwordcheck/regress/tmp_check --port 40029 passwordcheck
[11:25:56.865] ――――――――――――――――――――――――――――――――――――― ✀  ―――――――――――――――――――――――――――――――――――――
[11:25:56.865] stderr:
[11:25:56.865] pg_ctl: server does not shut down
[11:25:56.865] # could not stop postmaster: exit code was 256
[11:25:56.865] 
[11:25:56.865] (test program exited with status code 2)
[11:25:56.865] ――――――――――――――――――――――――――――――――――――――――――――――――――――――――――――――――――――――――――――――
[11:25:56.865] 
[11:25:56.895]  83/323 postgresql:pg_surgery / pg_surgery/regress                                      ERROR             0.03s   exit status 1
[11:25:56.895] >>> LD_LIBRARY_PATH=/tmp/cirrus-ci-build/build/tmp_install//usr/local/pgsql/lib/x86_64-linux-gnu MALLOC_PERTURB_=32 PATH=/tmp/cirrus-ci-build/build/tmp_install//usr/local/pgsql/bin:/tmp/cirrus-ci-build/build/contrib/pg_surgery:/usr/local/sbin:/usr/local/bin:/usr/sbin:/usr/bin:/sbin:/bin REGRESS_SHLIB=/tmp/cirrus-ci-build/build/src/test/regress/regress.so PG_REGRESS=/tmp/cirrus-ci-build/build/src/test/regress/pg_regress INITDB_TEMPLATE=/tmp/cirrus-ci-build/build/tmp_install/initdb-template /usr/bin/python3 /tmp/cirrus-ci-build/build/../src/tools/testwrap --basedir /tmp/cirrus-ci-build/build --srcdir /tmp/cirrus-ci-build/contrib/pg_surgery --pg-test-extra '' --testgroup pg_surgery --testname regress -- /tmp/cirrus-ci-build/build/src/test/regress/pg_regress --inputdir /tmp/cirrus-ci-build/contrib/pg_surgery --expecteddir /tmp/cirrus-ci-build/contrib/pg_surgery --bindir '' --dlpath /tmp/cirrus-ci-build/build/contrib/pg_surgery --max-concurrent-tests=20 --dbname regression_pg_surgery --outputdir /tmp/cirrus-ci-build/build/testrun/pg_surgery/regress --temp-instance /tmp/cirrus-ci-build/build/testrun/pg_surgery/regress/tmp_check --port 40037 heap_surgery
[11:25:56.895] ――――――――――――――――――――――――――――――――――――― ✀  ―――――――――――――――――――――――――――――――――――――
[11:25:56.895] stderr:
[11:25:56.895] Traceback (most recent call last):
[11:25:56.895]   File "/tmp/cirrus-ci-build/build/../src/tools/testwrap", line 34, in <module>
[11:25:56.895]     os.makedirs(testdir)
[11:25:56.895]   File "<frozen os>", line 215, in makedirs
[11:25:56.895]   File "<frozen os>", line 225, in makedirs
[11:25:56.895] OSError: [Errno 28] No space left on device: '/tmp/cirrus-ci-build/build/testrun/pg_surgery'
[11:25:56.895] 
[11:25:56.895] (test program exited with status code 1)
[11:25:56.895] ――――――――――――――――――――――――――――――――――――――――――――――――――――――――――――――――――――――――――――――
[11:25:56.895] 
[11:25:56.905] Exception in callback TestHarness._run_tests.<locals>.test_done(<Task finishe...t on device')>) at /usr/lib/python3/dist-packages/mesonbuild/mtest.py:1956
[11:25:56.905] handle: <Handle TestHarness._run_tests.<locals>.test_done(<Task finishe...t on device')>) at /usr/lib/python3/dist-packages/mesonbuild/mtest.py:1956>
[11:25:56.905] Traceback (most recent call last):
[11:25:56.905]   File "/usr/lib/python3.11/asyncio/events.py", line 80, in _run
[11:25:56.905]     self._context.run(self._callback, *self._args)
[11:25:56.905]   File "/usr/lib/python3/dist-packages/mesonbuild/mtest.py", line 1958, in test_done
[11:25:56.905]     f.result()
[11:25:56.905]   File "/usr/lib/python3/dist-packages/mesonbuild/mtest.py", line 1951, in run_test
[11:25:56.905]     self.process_test_result(res)
[11:25:56.905]   File "/usr/lib/python3/dist-packages/mesonbuild/mtest.py", line 1699, in process_test_result
[11:25:56.905]     l.log(self, result)
[11:25:56.905]   File "/usr/lib/python3/dist-packages/mesonbuild/mtest.py", line 759, in log
[11:25:56.905]     self.file.write(json.dumps(jresult) + '\n')
[11:25:56.905] OSError: [Errno 28] No space left on device
[11:25:56.906] 
[11:25:56.906] Summary of Failures:
[11:25:56.906] 
[11:25:56.906]   5/323 postgresql:pg_upgrade / pg_upgrade/003_logical_slots                            ERROR             1.35s   (exit status 255 or signal 127 SIGinvalid)
[11:25:56.906]   6/323 postgresql:recovery / recovery/001_stream_rep                                   ERROR             2.38s   (exit status 255 or signal 127 SIGinvalid)
[11:25:56.906]   7/323 postgresql:recovery / recovery/003_recovery_targets                             ERROR             4.46s   (exit status 255 or signal 127 SIGinvalid)
[11:25:56.906]   9/323 postgresql:recovery / recovery/004_timeline_switch                              ERROR             3.65s   (exit status 255 or signal 127 SIGinvalid)
[11:25:56.906]  10/323 postgresql:pg_upgrade / pg_upgrade/004_subscription                             ERROR             5.01s   (exit status 255 or signal 127 SIGinvalid)
[11:25:56.906]  11/323 postgresql:recovery / recovery/006_logical_decoding                             ERROR             1.42s   (exit status 255 or signal 127 SIGinvalid)
[11:25:56.906]  12/323 postgresql:recovery / recovery/009_twophase                                     ERROR             2.52s   (exit status 255 or signal 127 SIGinvalid)
[11:25:56.906]  13/323 postgresql:recovery / recovery/010_logical_decoding_timelines                   ERROR             1.86s   (exit status 255 or signal 127 SIGinvalid)
[11:25:56.906]  14/323 postgresql:recovery / recovery/007_sync_rep                                     ERROR             4.93s   (exit status 255 or signal 127 SIGinvalid)
[11:25:56.906]  15/323 postgresql:recovery / recovery/012_subtransactions                              ERROR             2.23s   (exit status 255 or signal 127 SIGinvalid)
[11:25:56.906]  17/323 postgresql:recovery / recovery/015_promotion_pages                              ERROR             3.11s   (exit status 255 or signal 127 SIGinvalid)
[11:25:56.906]  18/323 postgresql:recovery / recovery/016_min_consistency                              ERROR             3.16s   (exit status 255 or signal 127 SIGinvalid)
[11:25:56.906]  19/323 postgresql:recovery / recovery/014_unlogged_reinit                              ERROR             3.86s   (exit status 255 or signal 127 SIGinvalid)
[11:25:56.906]  20/323 postgresql:recovery / recovery/017_shm                                          ERROR             3.48s   (exit status 255 or signal 127 SIGinvalid)
[11:25:56.906]  21/323 postgresql:recovery / recovery/018_wal_optimize                                 ERROR             3.21s   (exit status 255 or signal 127 SIGinvalid)
[11:25:56.906]  22/323 postgresql:recovery / recovery/020_archive_status                               ERROR             1.17s   (exit status 255 or signal 127 SIGinvalid)
[11:25:56.906]  23/323 postgresql:recovery / recovery/019_replslot_limit                               ERROR             4.43s   (exit status 255 or signal 127 SIGinvalid)
[11:25:56.906]  24/323 postgresql:recovery / recovery/008_fsm_truncation                               ERROR            13.39s   (exit status 255 or signal 127 SIGinvalid)
[11:25:56.906]  25/323 postgresql:recovery / recovery/024_archive_recovery                             ERROR             2.60s   (exit status 255 or signal 127 SIGinvalid)
[11:25:56.906]  26/323 postgresql:recovery / recovery/021_row_visibility                               ERROR             6.18s   (exit status 255 or signal 127 SIGinvalid)
[11:25:56.906]  27/323 postgresql:recovery / recovery/023_pitr_prepared_xact                           ERROR             5.19s   (exit status 255 or signal 127 SIGinvalid)
[11:25:56.906]  29/323 postgresql:recovery / recovery/028_pitr_timelines                               ERROR             2.21s   (exit status 255 or signal 127 SIGinvalid)
[11:25:56.906]  30/323 postgresql:recovery / recovery/029_stats_restart                                ERROR             2.04s   (exit status 255 or signal 127 SIGinvalid)
[11:25:56.906]  31/323 postgresql:recovery / recovery/026_overwrite_contrecord                         ERROR             5.93s   (exit status 255 or signal 127 SIGinvalid)
[11:25:56.906]  32/323 postgresql:recovery / recovery/031_recovery_conflict                            ERROR             6.19s   (exit status 255 or signal 127 SIGinvalid)
[11:25:56.906]  33/323 postgresql:recovery / recovery/030_stats_cleanup_replica                        ERROR             6.57s   (exit status 255 or signal 127 SIGinvalid)
[11:25:56.906]  34/323 postgresql:recovery / recovery/033_replay_tsp_drops                             ERROR             3.46s   (exit status 255 or signal 127 SIGinvalid)
[11:25:56.906]  35/323 postgresql:recovery / recovery/032_relfilenode_reuse                            ERROR             7.08s   (exit status 255 or signal 127 SIGinvalid)
[11:25:56.906]  36/323 postgresql:recovery / recovery/034_create_database                              ERROR             3.53s   (exit status 255 or signal 127 SIGinvalid)
[11:25:56.906]  37/323 postgresql:recovery / recovery/036_truncated_dropped                            ERROR             2.43s   (exit status 255 or signal 127 SIGinvalid)
[11:25:56.906]  39/323 postgresql:recovery / recovery/035_standby_logical_decoding                     ERROR            10.85s   (exit status 255 or signal 127 SIGinvalid)
[11:25:56.906]  40/323 postgresql:recovery / recovery/038_save_logical_slots_shutdown                  ERROR             5.48s   (exit status 255 or signal 127 SIGinvalid)
[11:25:56.906]  41/323 postgresql:recovery / recovery/039_end_of_wal                                   ERROR             3.27s   (exit status 255 or signal 127 SIGinvalid)
[11:25:56.906]  42/323 postgresql:recovery / recovery/041_checkpoint_at_promote                        ERROR             2.33s   (exit status 255 or signal 127 SIGinvalid)
[11:25:56.906]  43/323 postgresql:recovery / recovery/042_low_level_backup                             ERROR             4.68s   (exit status 255 or signal 127 SIGinvalid)
[11:25:56.906]  44/323 postgresql:recovery / recovery/043_no_contrecord_switch                         ERROR             1.39s   (exit status 255 or signal 127 SIGinvalid)
[11:25:56.906]  45/323 postgresql:recovery / recovery/040_standby_failover_slots_sync                  ERROR            10.07s   (exit status 255 or signal 127 SIGinvalid)
[11:25:56.906]  46/323 postgresql:kerberos / kerberos/001_auth                                         ERROR             5.83s   (exit status 255 or signal 127 SIGinvalid)
[11:25:56.906]  47/323 postgresql:pg_upgrade / pg_upgrade/002_pg_upgrade                               ERROR            79.22s   (exit status 255 or signal 127 SIGinvalid)
[11:25:56.906]  48/323 postgresql:recovery / recovery/027_stream_regress                               ERROR            63.39s   (exit status 255 or signal 127 SIGinvalid)
[11:25:56.906]  49/323 postgresql:isolation / isolation/isolation                                      ERROR           180.77s   exit status 2
[11:25:56.906]  50/323 postgresql:regress / regress/regress                                            ERROR           184.39s   exit status 2
[11:25:56.906]  51/323 postgresql:plpgsql / plpgsql/regress                                            ERROR           122.94s   exit status 2
[11:25:56.906]  52/323 postgresql:plperl / plperl/regress                                              ERROR           121.95s   exit status 2
[11:25:56.906]  53/323 postgresql:plpython / plpython/regress                                          ERROR           122.59s   exit status 2
[11:25:56.906]  54/323 postgresql:pltcl / pltcl/regress                                                ERROR           120.81s   exit status 2
[11:25:56.906]  55/323 postgresql:recovery / recovery/013_crash_restart                                ERROR           211.94s   exit status 29
[11:25:56.906]  56/323 postgresql:recovery / recovery/022_crash_temp_files                             ERROR           211.49s   exit status 29
[11:25:56.906]  57/323 postgresql:amcheck / amcheck/regress                                            ERROR           123.31s   exit status 2
[11:25:56.906]  58/323 postgresql:basic_archive / basic_archive/regress                                ERROR           120.56s   exit status 2
[11:25:56.906]  59/323 postgresql:bloom / bloom/regress                                                ERROR           120.53s   exit status 2
[11:25:56.906]  60/323 postgresql:bool_plperl / bool_plperl/regress                                    ERROR           120.47s   exit status 2
[11:25:56.906]  61/323 postgresql:btree_gin / btree_gin/regress                                        ERROR           121.24s   exit status 2
[11:25:56.906]  62/323 postgresql:btree_gist / btree_gist/regress                                      ERROR           121.33s   exit status 2
[11:25:56.913] Traceback (most recent call last):
[11:25:56.913]   File "/usr/lib/python3/dist-packages/mesonbuild/mtest.py", line 2027, in _run_tests
[11:25:56.913]     await complete_all(futures)
[11:25:56.913]   File "/usr/lib/python3/dist-packages/mesonbuild/mtest.py", line 1236, in complete_all
[11:25:56.913]     check_futures(done)
[11:25:56.913]   File "/usr/lib/python3/dist-packages/mesonbuild/mtest.py", line 1226, in check_futures
[11:25:56.913]     f.result()
[11:25:56.913] OSError: [Errno 28] No space left on device
[11:25:56.913] 
[11:25:56.913] During handling of the above exception, another exception occurred:
[11:25:56.913] 
[11:25:56.913] Traceback (most recent call last):
[11:25:56.913]   File "/usr/lib/python3/dist-packages/mesonbuild/mtest.py", line 1927, in run_tests
[11:25:56.913]     loop.run_until_complete(self._run_tests(runners))
[11:25:56.913]   File "/usr/lib/python3.11/asyncio/base_events.py", line 653, in run_until_complete
[11:25:56.913]     return future.result()
[11:25:56.913]            ^^^^^^^^^^^^^^^
[11:25:56.913]   File "/usr/lib/python3/dist-packages/mesonbuild/mtest.py", line 2033, in _run_tests
[11:25:56.913]     await l.finish(self)
[11:25:56.913]   File "/usr/lib/python3/dist-packages/mesonbuild/mtest.py", line 887, in finish
[11:25:56.913]     tree.write(f, encoding='utf-8', xml_declaration=True)
[11:25:56.913]   File "/usr/lib/python3.11/xml/etree/ElementTree.py", line 743, in write
[11:25:56.913]     serialize(write, self._root, qnames, namespaces,
[11:25:56.913]   File "/usr/lib/python3.11/xml/etree/ElementTree.py", line 906, in _serialize_xml
[11:25:56.913]     _serialize_xml(write, e, qnames, None,
[11:25:56.913]   File "/usr/lib/python3.11/xml/etree/ElementTree.py", line 906, in _serialize_xml
[11:25:56.913]     _serialize_xml(write, e, qnames, None,
[11:25:56.913]   File "/usr/lib/python3.11/xml/etree/ElementTree.py", line 906, in _serialize_xml
[11:25:56.913]     _serialize_xml(write, e, qnames, None,
[11:25:56.913]   File "/usr/lib/python3.11/xml/etree/ElementTree.py", line 904, in _serialize_xml
[11:25:56.913]     write(_escape_cdata(text))
[11:25:56.913] OSError: [Errno 28] No space left on device
[11:25:56.913] 
[11:25:56.913] During handling of the above exception, another exception occurred:
[11:25:56.913] 
[11:25:56.913] OSError: [Errno 28] No space left on device
[11:25:56.913] 
[11:25:56.913] During handling of the above exception, another exception occurred:
[11:25:56.913] 
[11:25:56.913] Traceback (most recent call last):
[11:25:56.913]   File "/usr/lib/python3/dist-packages/mesonbuild/mesonmain.py", line 194, in run
[11:25:56.913]     return options.run_func(options)
[11:25:56.913]            ^^^^^^^^^^^^^^^^^^^^^^^^^
[11:25:56.913]   File "/usr/lib/python3/dist-packages/mesonbuild/mtest.py", line 2107, in run
[11:25:56.913]     return th.doit()
[11:25:56.913]            ^^^^^^^^^
[11:25:56.913]   File "/usr/lib/python3/dist-packages/mesonbuild/mtest.py", line 1788, in doit
[11:25:56.913]     self.run_tests(runners)
[11:25:56.913]   File "/usr/lib/python3/dist-packages/mesonbuild/mtest.py", line 1929, in run_tests
[11:25:56.913]     self.close_logfiles()
[11:25:56.913]   File "/usr/lib/python3/dist-packages/mesonbuild/mtest.py", line 1636, in close_logfiles
[11:25:56.913]     l.close()
[11:25:56.913]   File "/usr/lib/python3/dist-packages/mesonbuild/mtest.py", line 489, in close
[11:25:56.913]     self.file.close()
[11:25:56.913] OSError: [Errno 28] No space left on device
[11:25:56.913]  63/323 postgresql:citext / citext/regress                                              ERROR           120.68s   exit status 2
[11:25:56.913]  64/323 postgresql:cube / cube/regress                                                  ERROR           120.65s   exit status 2
[11:25:56.913]  65/323 postgresql:dblink / dblink/regress                                              ERROR           120.67s   exit status 2
[11:25:56.913]  66/323 postgresql:dict_int / dict_int/regress                                          ERROR           120.46s   exit status 2
[11:25:56.913]  67/323 postgresql:dict_xsyn / dict_xsyn/regress                                        ERROR           120.45s   exit status 2
[11:25:56.913]  68/323 postgresql:earthdistance / earthdistance/regress                                ERROR           120.65s   exit status 2
[11:25:56.913]  69/323 postgresql:file_fdw / file_fdw/regress                                          ERROR           120.48s   exit status 2
[11:25:56.913]  70/323 postgresql:fuzzystrmatch / fuzzystrmatch/regress                                ERROR           120.46s   exit status 2
[11:25:56.913]  71/323 postgresql:hstore / hstore/regress                                              ERROR           121.55s   exit status 2
[11:25:56.913]  72/323 postgresql:hstore_plperl / hstore_plperl/regress                                ERROR           120.65s   exit status 2
[11:25:56.913]  73/323 postgresql:hstore_plpython / hstore_plpython/regress                            ERROR           120.49s   exit status 2
[11:25:56.913]  74/323 postgresql:isn / isn/regress                                                    ERROR           120.58s   exit status 2
[11:25:56.913]  75/323 postgresql:intarray / intarray/regress                                          ERROR           125.46s   exit status 2
[11:25:56.913]  76/323 postgresql:jsonb_plperl / jsonb_plperl/regress                                  ERROR           120.51s   exit status 2
[11:25:56.913]  77/323 postgresql:jsonb_plpython / jsonb_plpython/regress                              ERROR           120.46s   exit status 2
[11:25:56.913]  78/323 postgresql:lo / lo/regress                                                      ERROR           120.46s   exit status 2
[11:25:56.913]  79/323 postgresql:ltree / ltree/regress                                                ERROR           120.89s   exit status 2
[11:25:56.913]  80/323 postgresql:ltree_plpython / ltree_plpython/regress                              ERROR           120.49s   exit status 2
[11:25:56.913]  81/323 postgresql:pageinspect / pageinspect/regress                                    ERROR           121.05s   exit status 2
[11:25:56.913]  82/323 postgresql:passwordcheck / passwordcheck/regress                                ERROR           120.45s   exit status 2
[11:25:56.913]  83/323 postgresql:pg_surgery / pg_surgery/regress                                      ERROR             0.03s   exit status 1
[11:25:56.913] 
[11:25:56.913] Ok:                 8   
[11:25:56.913] Expected Fail:      0   
[11:25:56.913] Fail:               75  
[11:25:56.913] Unexpected Pass:    0   
[11:25:56.913] Skipped:            0   
[11:25:56.913] Timeout:            0   
[11:25:56.913] 
[11:25:56.913] 
[11:25:56.913] ERROR: Unhandled python OSError. This is probably not a Meson bug, but an issue with your build environment.
[11:25:56.998] 
[11:25:56.998] Exit status: 28������������������������������������������������������������������������������������������������������������������������������������������������������������������������������������������������������������������������������������������������������������������������������������������������������������������������������������������������������������������������������������������������������������������������������������������������������������������������������������������������������������������������������������������������������������������������������������������������������������������������������������������������������������������������������������������������������������������������������������������������������������������������������������������������������������������������������������������������������������������������������������������������������������������������������������������������������������������������������������������������������������������������������������������������������������������������������������������������������������������������������������������������������������������������������������������������������������������������������������������������������������������������������������������������������������������������������������������������������������������������������������������������������������������������������������������������������������������������������������������������������������������������������������������������������������������������������������������������������������������������������������������������������������������������������������������������������������������������������������������������������������������������������������������������������������������������������������������������������������������������������������������������������������������������������������������������������������������������������������������������������������������������������������������������������������������������������������������������������������������������������������������������������������������������������������������������������������������������������������������������������������������������������������������������������������������������������������������������������������������������������������������������������������������������������������������������������������������������������������������������������������������������������������������������������������������������������������������������������������������������������������������������������������������������������������������������������������������������������������������������������������������������������������������������������������������������������������������������������������������������������������������������������������������������������������������������������������������������������������������������������������������������������������������������������������������������������������������������������������������������������������������������������������������������������������������������������������������������������������������������������������������������������������������������������������������������������������������������������������������������������������������������������������������������������������������������������������������������������������������������������������������������������������������������������������������������������������������������������������������������������������������������������������������������������������������������������������������������������������������������������������������������������������������������������������������������������������������������������������������������������������������������������������������������������������������������������������������������������������������������������������������������������������������������������������������������������������������������������������������������������������������������������������������������������������������������������������������������������������������������������������������������������������������������������������������������������������������������������������������������������������������������������������������������������������������������������������������������������������������������������������������������������������������������������������������������������������������������������������������������������������������������������������������������������������������������������������������������������������������������������������������������������������������������������������������������������������������������������������������������������������������������������������������������������������������������������������������������������������������������������������������������������������������������������������������������������������������������������������������������������������������������������������������������������������������������������������������������������������������������������������������������������������������������������������������������������������������������������������������������������������������������������������������������������������������������������������������������������������������������������������������������������������������������������������������������������������������������������������������������������������������������������������������������������������������������������������������������������������������������������������������������������������������������������������������������������������������������������������������������������������������������������������������������������������������������������������������������������������������������������������������������������������������������������������������������������������������������������������������������������������������������������������������������������������������������������������������������������������������������������������������������������������������������������������������������������������������������������������������������������������������������������������������������������������������������������������������������������������������������������������������������������������������������������������������������������������������������������������������������������������������������������������������������������������������������������������������������������������������������������������������������������������������������������������������������������������������������������������������������������������������������������������������������������������������������������������������������������������������������������������������������������������������������������������������������������������������������������������������������������������������������������������������������������������������������������������������������������������������������������������������������������������������������������������������������������������������������������������������������������������������������������������������������������������������������������������������������������������������������������������������������������������������������������������������������������������������������������������������������������������������������������������������������������������������������������������������������������������������������������������������������������������������������������������������������������������������������������������������������������������������������������������������������������������������������������������������������������������������������������������������������������������������������������������������������������������������������������������������������������������������������������������������������������������������������������������������������������������������������������������������������������������������������������������������������������������������������������������������������������������������������������������������������������������������������������������������������������������������������������������������������������������������������������������������������������������������������������������������������������������������������������������������������������������������������������������������������������������������������������������������������������������������������������������������������������������������������������������������������������������������������������������������������������������������������������������������������������������������������������������������������������������������������������������������������������������������������������������������������������������������������������������������������������������������������������������������������������������������������������������������������������������������������������������������������������������������������������������������������������������������������������������������������������������������������������������������������������������������������������������������������������������������������������������������������������������������������������������������������������������������������������������������������������������������������������������������������������������������������������������������������������������������������������������������������������������������������������������������������������������������������������������������������������������������������������������������������������������������������������������������������������������������������������������������������������������������������������������������������������������������������������������������������������������������������������������������������������������������������������������������������������������������������������������������������������������������������������������������������������������������������������������������������������������������������������������������������������������������������������������������������������������������������������������������������������������������������������������������������������������������������������������������������������������������������������������������������������������������������������������������������������������������������������������������������������������������������������������������������������������������������������������������������������������������������������������������������������������������������������������������������������������������������������������������������������������������������������������������������������������������������������������������������������������������������������������������������������������������������������������������������������������������������������������������������������������������������������������������������������������������������������������������������������������������������������������������������������������������������������������������������������������������������������������������������������������������������������������������������������������������������������������������������������������������������������������������������������������������������������������������������������������������������������������������������������������������������������������������������������������������������������������������������������������������������������������������������������������������������������������������������������������������������������������������������������������������������������������������������������������������������������������������������������������������������������������������������������������������������������������������������������������������������������������������������������������������������������������������������������������������������������������������������������������������������������������������������������������������������������������������������������������������������������������������������������������������������������������������������������������������������������������������������������������������������������������������������������������������������������������������������������������������������������������������������������������������������������������������������������������������������������������������������������������������������������������������������������������������������������������������������������������������������������������������������������������������������������������������������������������������������������������������������������������������������������������������������������������������������������������������������������������������������������������������������������������������������������������������������������������������������������������������������������������������������������������������������������������������������������������������������������������������������������������������������������������������������������������������������������������������������������������������������������������������������������������������������������������������������������������������������������������������������������������������������������������������������������������������������������������������������������������������������������������������������������������������������������������������������������������������������������������������������������������������������������������������������������������������������������������������������������������������������������������������������������������������������������������������������������������������������������������������������������������������������������������������������������������������������������������������������������������������������������������������������������������������������������������������������������������������������������������������������������������������������������������������������������������������������������������������������������������������������������������������������������������������������������������������������������������������������������������������������������������������������������������������������������������������������������������������������������������������������������������������������������������������������������������������������������������������������������������������������������������������������������������������������������������������������������������������������������������������������������������������������������������������������������������������������������������������������������������������������������������������������������������������������������������������������������������������������������������������������������������������������������������������������������������������������������������������������������������������������������������������������������������������������������������������������������������������������������������������������������������������������������������������������������������������������������������������������������������������������������������������������������������������������������������������������������������������������������������������������������������������������������������������������������������������������������������������������������������������������������������������������������������������������������������������������������������������������������������������������������������������������������������������������������������������������������������������������������������������������������������������������������������������������������������������������������������������������������������������������������������������������������������������������������������������������������������������������������������������������������������������������������������������������������������������������������������������������������������������������������������������������������������������������������������������������������������������������������������������������������������������������������������������������������������������������������������������������������������������������������������������������������������������������������������������������������������������������������������������������������������������������������������������������������������������������������������������������������������������������������������������������������������������������������������������������������������������������������������������������������������������������������������������������������������������������������������������������������������������������������������������������������������������������������������������������������������������������������������������������������������������������������������������������������������������������������������������������������������������������������������������������������������������������������������������������������������������������������������������������������������������������������������������������������������������������������������������������������������������������������������������������������������������������������������������������������������������������������������������������������������������������������������������������������������������������������������������������������������������������������������������������������������������������������������������������������������������������������������������������������������������������������������������������������������������������������������������������������������������������������������������������������������������������������������������������������������������������������������������������������������������������������������������������������������������������������������������������������������������������������������������������������������������������������������������������������������������������������������������������������������������������������������������������������������������������������������������������������������������������������������������������������������������������������������������������������������������������������������������������������������������������������������������������������������������������������������������������������������������������������������������������������������������������������������������������������������������������������������������������������������������������������������������������������������������������������������������������������������������������������������������������������������������������������������������������������������������������������������������������������������������������������������������������������������������������������������������������������������������������������������������������������������������������������������������������������������������������������������������������������������������������������������������������������������������������������������������������������������������������������������������������������������������������������������������������������������������������������������������������������������������������������������������������������������������������������������������������������������������������������������������������������������������������������������������������������������������������������������������������������������������������������������������������������������������������������������������������������������������������������������������������������������������������������������������������������������������������������������������������������������������������������������������������������������������������������������������������������������������������������������������������������������������������������������������������������������������������������������������������������������������������������������������������������������������������������������������������������������������������������������������������������������������������������������������������������������������������������������������������������������������������������������������������������������������������������������������������������������������������������������������������������������������������������������������������������������������������������������������������������������������������������������������������������������������������������������������������������������������������������������������������������������������������������������������������������������������������������������������������������������������������������������������������������������������������������������������������������������������������������������������������������������������������������������������������������������������������������������������������������������������������������������������������������������������������������������������������������������������������������������������������������������������������������������������������������������������������������������������������������������������������������������������������������������������������������������������������������������������������������������������������������������������������������������������������������������������������������������������������������������������������������������������������������������������������������������������������������������������������������������������������������������������������������������������������������������������������������������������������������������������������������������������������������������������������������������������������������������������������������������������������������������������������������������������������������������������������������������������������������������������������������������������������������������������������������������������������������������������������������������������������������������������������������������������������������������������������������������������������������������������������������������������������������������������������������������������������������������������������������������������������������������������������������������������������������������������������������������������������������������������������������������������������������������������������������������������������������������������������������������������������������������������������������������������������������������������������������������������������������������������������������������������������������������������������������������������������������������������������������������������������������������������������������������������������������������������������������������������������������������������������������������������������������������������������������������������������������������������������������������������������������������������������������������������������������������������������������������������������������